program: Gaussian 09
title: 000084304
version: EM64L-G09RevD.01
frameworkgroup: C1[X(C6H3ClN3O2)]
method: RPBEPBE
basis: SDD
operation: Freq
keyword: #p
keyword: freq=noraman
keyword: PBEPBE/SDD
title: #p freq=noraman PBEPBE/SDD
converged: YES YES NO YES
title: Mulliken charges:
elementType: Cl O O N N N C C C C C C H H H
charge: 0.163230 -0.096479 -0.149749 0.051374 0.051634 0.173103 0.307525 0.321940 -0.224937 -0.271196 -0.159074 -0.137850 0.347771 0.306761 0.315946
chargesum: 1.00000
title: Mulliken charges with hydrogens summed into heavy atoms:
elementType: Cl O O N N N C C C C C C
charge: 0.163230 -0.096479 -0.149749 0.051374 0.051634 0.173103 0.307525 0.321940 0.122834 0.035566 -0.159074 0.178096
polarizability: 1.90603762e+02 -2.14496689e+01 1.20012117e+02 -2.62351158e-02 4.80330368e-03 3.57371664e+01
1716.lowfreq: 0.0006 0.0008 0.0013 1.6301 11.3340 11.3433 68.2348 82.7869 148.9269
frequency: 68.2344 82.7849 148.9231 162.1942 198.1807 243.9565 285.6864 343.4120 361.3550 409.8881 422.9231 472.0937 547.6287 560.4339 620.8406 656.9833 668.3728 699.5109 741.6202 835.5341 842.4559 929.3391 976.7302 1041.1634 1096.7724 1156.8938 1175.9514 1183.7356 1256.6364 1350.9044 1398.6806 1446.2707 1447.9959 1531.9905 1585.5261 2087.0991 3172.8720 3173.4232 3189.6632
redmass: 14.4385 9.7678 6.0495 15.8308 14.2733 7.4591 9.9067 15.0084 9.4897 3.3462 14.4024 10.5718 5.3480 7.0675 8.1192 4.8300 9.0302 6.9575 8.7441 1.3629 8.6084 1.4014 1.3543 2.8911 3.8689 1.7676 2.9967 7.7484 1.3657 3.6956 14.0319 2.3220 6.4038 7.6304 7.4865 13.9257 1.0932 1.0922 1.0990
irintensity: 1.0754 0.0897 1.0589 12.6560 1.0123 0.0069 15.3040 10.3076 4.3995 2.7325 2.0322 2.7366 20.0553 3.9920 5.4028 0.7419 12.4809 2.5051 28.6671 45.0144 19.0082 17.2599 1.3527 11.4533 56.1485 31.4979 18.3906 240.8062 1.2324 2.8729 108.0272 6.5335 57.2136 31.4276 255.3314 246.0899 25.4939 7.3035 10.9252
temp: 298.150 k
press: 1.00000 atm
elementType: 17 8 8 7 7 7 6 6 6 6 6 6 1 1 1
symmnumber: 1
zpe: 230727.7 jmol-1
zpe.correction: 0.087880 hartree
zpe.thermalcorrener: 0.097971 hartree
zpe.thermalcorrenthalpy: 0.098915 hartree
zpe.thermalcorrgfe: 0.051334 hartree
zpe.sumelectzpe: -1003.937241 hartree
zpe.sumelectthermal: -1003.927150 hartree
zpe.sumelectthermalent: -1003.926206 hartree
zpe.sumelectthermalfe: -1003.973786 hartree
dipole: -0.7428 -5.7570 0.0027
dipole: 5.8047
quadrupole: -56.0104 -57.1520 -70.9780
quadrupole: -6.7918 0.0052 0.0008
quadrupole: 5.3698 4.2281 -9.5979 -6.7918 0.0052 0.0008
hfenergy: -1004.0251207 hartree
pointgroup: C01 [X(C6H3Cl1N3O2)]
dipole: 0.3764981 2.2524934 0.0005623 debye
dipolederiv: -0.7310433 0.1955636 0.0001329 0.2127531 -0.033194 -0.0000305 0.0003302 -0.0001192 0.0931551 -0.3440095 0.028648 -0.0000964 -0.0040179 -0.6202496 0.0003918 0.0001848 -0.0004833 -0.1319231 -0.4989799 0.1513383 0.0004664 -0.0467655 -0.7086874 0.0000707 -0.0002539 -0.0000741 -0.1707961 1.041758 -0.023821 -0.000177 0.2584041 1.2929295 -0.000173 -0.0005423 -0.0002449 0.2094307 1.6017228 -0.4631804 -0.0016274 -0.5002406 1.0136575 0.0004019 0.0032228 -0.0026601 0.2204873 -0.498462 0.3802998 0.0019082 0.3343835 -0.3989492 -0.000845 -0.0027937 0.0025812 0.1071398 0.2141287 -0.3318496 0.0000359 -0.6688598 -0.0959436 -0.0000873 0.0008416 -0.0000463 0.1330597 -1.0979631 0.2686257 -0.0003723 0.3127517 0.0323069 0.0001967 -0.001154 0.0008867 0.0734406 -0.7517861 0.1285067 0.0000126 -0.2425911 0.0182981 -0.0000373 0.0005668 0.0001647 0.0127413 0.4996002 -0.3789431 0.0000719 0.1952304 0.062249 0.0000576 0.0003462 -0.0000701 -0.0292571 1.5983137 -0.3553248 -0.0003136 -0.3072492 0.3119441 0.0000708 -0.0006037 0.0001248 -0.0313099 -0.3438561 0.393617 -0.0000598 0.4421631 -0.2767379 -0.0000578 0.0002118 -0.0002608 -0.0190785 0.1384343 -0.0305169 -0.0000023 -0.0143476 0.1697779 -0.0000195 -0.0001585 0.0000096 0.1792042 0.0755657 0.0416039 0.0000066 0.0088338 0.1106773 0.0000257 -0.0000525 0.0000626 0.1806977 0.0965766 -0.004567 0.0000144 0.0195521 0.1219212 0.0000356 -0.0001457 0.0001294 0.1730084 unknown
polarizability: 188.9067069|-24.0209524|121.7091681|0.0224529|-0.023009|35.7371699 unknown
InChI: InChI=1S/C6H3ClN3O2/c7-4-1-2-5(9-8)6(3-4)10(11)12/h1-3H
charge 1 multiplicity 1
15 atoms
Cl 3.907436 -0.497707 -0.000921
O  -0.929124 -2.778115 -0.00036
O  -2.437626 -1.053145 0.000323
N  -1.237982 -1.544127 0.001183
N  -1.778855 1.301758 0.001078
N  -2.774808 1.895002 -0.003466
C  -0.139589 -0.532327 0.000604
C  -0.463909 0.857974 0.000679
C  1.188357 -0.954807 0.000151
C  0.572154 1.838655 0.000109
C  2.214163 0.029343 -0.000305
C  1.910783 1.415676 -0.000327
H  1.413038 -2.026335 0.000187
H  0.329184 2.905584 0.00006
H  2.715576 2.156072 -0.000696
