program: Gaussian 09
title: 000084281
version: EM64L-G09RevD.01
frameworkgroup: C1[X(C6H3Cl2N2)]
method: RPBEPBE
basis: SDD
operation: Freq
keyword: #p
keyword: freq=noraman
keyword: PBEPBE/SDD
title: #p freq=noraman PBEPBE/SDD
converged: NO YES NO YES
title: Mulliken charges:
elementType: Cl Cl N N C C C C C C H H H
charge: 0.146919 0.107782 0.018179 0.189656 0.589025 -0.362516 -0.276008 -0.101349 -0.115835 -0.134535 0.318590 0.311012 0.309081
chargesum: 1.00000
title: Mulliken charges with hydrogens summed into heavy atoms:
elementType: Cl Cl N N C C C C C C
charge: 0.146919 0.107782 0.018179 0.189656 0.589025 -0.362516 0.042582 -0.101349 0.195177 0.174546
polarizability: 1.57636953e+02 -1.32736581e+01 1.13221651e+02 -1.50430000e-03 -1.03887481e-02 3.33259090e+01
1716.lowfreq: -6.4384 -0.0023 0.0014 0.0020 3.3605 12.6305 87.0773 131.6358 135.8757
frequency: 87.0732 131.6352 135.8748 195.5659 274.2164 311.2380 321.3150 386.2791 435.8153 471.4660 525.9758 573.3249 603.7558 671.7918 686.2690 841.0520 847.2880 877.8483 979.1386 1029.6294 1082.4129 1150.1832 1181.2531 1259.1740 1351.3799 1388.8024 1439.4174 1525.8235 1561.1108 2106.5689 3172.2854 3179.9863 3186.9330
redmass: 10.0571 15.8137 6.5467 16.3752 7.2665 24.5800 7.4410 4.1482 12.0038 3.9468 8.0773 6.4277 8.5485 7.2212 3.8094 1.3649 7.4060 1.4892 1.3820 7.0589 2.1999 1.9707 2.4009 1.3707 2.7402 9.2834 2.5242 6.5630 6.2650 13.9348 1.0912 1.0952 1.0981
irintensity: 2.5239 0.0062 0.0553 3.2100 0.2026 0.1082 0.4577 0.4154 8.0405 25.7190 7.3363 3.2322 19.8298 0.4513 1.6075 40.2215 12.5615 14.4791 0.4083 32.2518 62.8181 16.0128 99.8585 13.7277 12.7340 18.7302 157.4138 40.2816 50.7069 229.2237 1.9957 16.2803 8.7440
temp: 298.150 k
press: 1.00000 atm
elementType: 17 17 7 7 6 6 6 6 6 6 1 1 1
symmnumber: 1
zpe: 203197.0 jmol-1
zpe.correction: 0.077394 hartree
zpe.thermalcorrener: 0.086153 hartree
zpe.thermalcorrenthalpy: 0.087097 hartree
zpe.thermalcorrgfe: 0.042468 hartree
zpe.sumelectzpe: -1259.036108 hartree
zpe.sumelectthermal: -1259.027348 hartree
zpe.sumelectthermalent: -1259.026404 hartree
zpe.sumelectthermalfe: -1259.071033 hartree
dipole: -1.4563 1.1014 -0.0002
dipole: 1.8259
quadrupole: -53.0531 -47.8047 -68.9895
quadrupole: -4.7396 0.0006 -0.0032
quadrupole: 3.5627 8.8111 -12.3738 -4.7396 0.0006 -0.0032
hfenergy: -1259.1135013 hartree
pointgroup: C01 [X(C6H3Cl2N2)]
dipole: 0.6760898 0.2427628 0.0000898 debye
dipolederiv: -0.3943877 0.3820865 0.000041 0.1567056 -0.1382925 -0.0000311 -0.0000195 -0.0000029 0.0941219 -0.5252314 0.2093956 0.0000179 0.2984634 -0.095007 -0.0000143 0.0000253 -0.0000057 0.0527761 1.1280683 0.9646906 0.0002716 0.7452571 0.6705556 0.0001493 0.0000118 -0.0000583 0.2111251 -0.3760531 -0.4755639 -0.0002047 -0.3296412 -0.1954523 -0.0001303 0.0000654 0.0000779 0.1176221 -0.6546339 -0.5746301 -0.0000901 -0.4638145 -0.2547478 -0.0000516 -0.0000788 -0.0000367 0.1264549 0.9865672 -0.618809 -0.0000561 0.169504 0.5024244 0.00008 0.0000766 0.0000371 -0.0558367 -0.0013167 0.5580786 0.0000793 -0.1177441 -0.0297276 -0.000004 -0.0000329 -0.0000065 -0.0099329 1.1037066 -0.7417987 -0.0000759 -0.6537549 -0.1967727 -0.0000431 -0.0000581 -0.0000616 -0.0663173 -0.687843 0.2049485 0.0000113 0.0569962 0.1184425 0.0000292 -0.0000264 0.0000384 -0.0208763 0.146329 0.0808437 0.0000097 0.1086441 0.2677887 0.0000417 0.0000182 0.0000458 0.028565 0.0840743 -0.0159862 -0.0000069 -0.0057063 0.1223435 -0.0000108 0.000002 -0.000003 0.1879663 0.0936235 0.0274901 0.0000054 0.0218695 0.1048076 -0.0000113 0.0000186 -0.0000122 0.1749136 0.0970968 -0.0007457 -0.0000025 0.0132213 0.1236376 -0.0000038 -0.0000023 -0.0000122 0.1594182 unknown
polarizability: 161.2437123|-1.7279972|109.6148912|0.0016618|0.0103647|33.325909 unknown
InChI: InChI=1S/C6H3Cl2N2/c7-4-1-2-5(8)6(3-4)10-9/h1-3H
charge 1 multiplicity 1
13 atoms
Cl 2.256536 -1.894242 -0.00024
Cl -3.380213 1.175547 0.000056
N  1.791495 1.095942 0.000295
N  2.775546 1.705387 0.000176
C  0.616441 0.3768 0.000088
C  0.683228 -1.057494 -0.000187
C  -0.6213 1.093707 0.000139
C  -1.801697 0.3391 -0.00002
C  -0.526628 -1.772609 -0.000296
C  -1.759891 -1.08341 -0.000226
H  -0.637532 2.187448 0.000312
H  -0.509164 -2.866002 -0.000447
H  -2.695221 -1.651975 -0.00035
