program: Gaussian 09
title: 000084278
version: EM64L-G09RevD.01
frameworkgroup: C1[X(C5H11NO3)]
method: RPBEPBE
basis: SDD
operation: Freq
keyword: #p
keyword: freq=noraman
keyword: PBEPBE/SDD
title: #p freq=noraman PBEPBE/SDD
converged: YES YES NO NO
title: Mulliken charges:
elementType: O O O N C C C C C H H H H H H H H H H H
charge: -0.302420 -0.442282 -0.312746 -0.371624 0.035147 -0.682461 -0.677558 0.329749 -0.315084 0.236572 0.209075 0.233035 0.222202 0.212752 0.250465 0.218843 0.329365 0.234252 0.225209 0.367510
chargesum: 0.00000
title: Mulliken charges with hydrogens summed into heavy atoms:
elementType: O O O N C C C C C
charge: -0.302420 -0.074772 -0.312746 -0.042259 0.271718 -0.018149 0.004501 0.329749 0.144378
polarizability: 9.44633058e+01 2.25886413e+00 6.65553614e+01 6.96108751e-01 4.53192237e+00 5.81606819e+01
1716.lowfreq: -6.4990 -0.0009 -0.0008 -0.0007 7.1995 13.2711 37.6794 55.8751 69.9659
frequency: 37.6057 55.7912 69.9576 123.6495 150.7855 190.3401 235.0908 278.9536 291.0031 378.5308 404.9423 454.7340 477.8569 526.0609 565.9125 678.0536 710.0982 792.1314 872.3338 915.8440 925.5340 939.9797 947.4526 1036.6447 1090.8945 1108.5940 1157.9907 1178.4894 1196.9501 1256.2899 1323.8489 1339.8206 1339.9622 1377.5211 1395.6134 1399.5023 1448.8354 1456.2544 1463.6433 1468.2110 1472.8959 1487.2196 1632.7768 2988.3700 2993.1538 3014.6520 3029.3749 3083.9403 3093.7460 3098.4854 3103.6446 3122.6227 3542.4752 3574.3615
redmass: 3.3995 4.1495 5.7254 6.1431 2.7442 1.0258 1.1139 3.5277 2.4884 3.9263 2.8606 2.3074 1.2482 1.3959 2.9282 4.3512 10.3276 3.5930 2.8721 2.8947 1.2329 1.3765 5.7718 1.7575 2.9650 2.3247 2.0564 2.0307 1.7629 1.4989 1.4009 1.2782 1.2079 1.2610 1.2332 1.1390 1.1262 1.0542 1.1026 1.5171 1.1302 1.0559 8.1349 1.0355 1.0359 1.0652 1.0867 1.0993 1.0988 1.1007 1.1005 1.1016 1.0656 1.0784
irintensity: 2.9264 0.5312 9.6245 1.2194 4.6973 0.0371 0.3566 17.1060 13.1116 6.1132 2.3196 19.1829 145.2654 77.3362 105.9253 9.2775 27.1989 17.1967 25.8893 71.6281 2.7273 7.5707 255.4625 45.3044 29.7395 94.8807 16.3998 147.0346 129.8079 115.7164 3.5576 5.3567 18.2609 33.0249 29.8079 34.1914 16.6808 6.7218 43.5712 232.4180 63.5926 33.9152 216.7956 15.9707 21.0367 51.9890 6.1150 6.7367 51.4609 18.5167 35.2618 20.2887 9.5478 36.2690
temp: 298.150 k
press: 1.00000 atm
elementType: 8 8 8 7 6 6 6 6 6 1 1 1 1 1 1 1 1 1 1 1
symmnumber: 1
zpe: 432446.6 jmol-1
zpe.correction: 0.164710 hartree
zpe.thermalcorrener: 0.175639 hartree
zpe.thermalcorrenthalpy: 0.176583 hartree
zpe.thermalcorrgfe: 0.127348 hartree
zpe.sumelectzpe: -476.825236 hartree
zpe.sumelectthermal: -476.814308 hartree
zpe.sumelectthermalent: -476.813364 hartree
zpe.sumelectthermalfe: -476.862598 hartree
dipole: 2.0903 -1.5917 -0.5026
dipole: 2.6750
quadrupole: -53.7357 -52.3098 -56.3851
quadrupole: 6.2334 -1.5841 0.7595
quadrupole: 0.4078 1.8338 -2.2416 6.2334 -1.5841 0.7595
hfenergy: -476.9899464 hartree
pointgroup: C01 [X(C5H11N1O3)]
dipole: -0.8387544 0.5087673 -0.3810609 debye
dipolederiv: -1.8737621 -0.1915757 -0.1856111 -0.0393333 -0.438151 0.0656371 -0.3211083 0.0397753 -0.4471756 -0.7206255 0.0838774 -0.1960761 0.4115766 -0.7309405 -0.081805 -0.2101469 -0.0901355 -0.3735317 -0.7615653 -0.0226301 -0.074436 0.0066229 -0.5230721 0.2845639 -0.0761346 0.2690947 -0.8360155 -1.4670411 -0.109738 0.1566665 -0.3384926 -0.7454895 0.0908615 0.1979909 0.0773805 -0.4359429 1.0060461 0.1313199 0.0118475 0.2544864 0.4905529 0.0470972 -0.2322174 0.0247515 0.2424108 -0.113603 0.0512918 -0.0340872 0.0630103 -0.048424 0.0115584 -0.0116295 0.0204503 0.0787296 -0.0917747 0.0316036 -0.0164781 -0.0371261 -0.191077 -0.036167 0.042059 -0.0581656 0.0585513 2.2820333 0.346928 0.016174 0.2032681 0.6224245 -0.4981785 0.1334316 -0.4445458 1.0983744 1.1865352 -0.148211 0.0685953 -0.3869931 0.8083512 0.0544456 0.310095 0.0467333 0.3977517 0.0101847 -0.0103486 -0.0497001 -0.0459819 0.0174773 -0.0201378 0.0478434 -0.0175874 -0.0983567 -0.1146938 -0.0587635 0.0595718 -0.0902734 0.0610799 0.0541152 0.0773796 0.0455064 0.0598499 0.105458 -0.0214233 -0.0174813 0.0174532 -0.1391703 -0.0644179 -0.0232963 -0.0684399 0.0738697 0.0931906 0.0133862 0.0119186 0.0208515 0.0903604 -0.0317261 -0.0542638 0.0095646 -0.1416352 -0.0916642 -0.1092468 0.0791199 -0.1171829 0.0467459 0.0132432 0.0810309 0.0305763 0.0618793 -0.0231724 0.1253316 -0.0449211 0.1060181 0.0293515 0.011833 -0.0497346 0.0299336 0.07614 0.1112086 -0.0039526 -0.0116802 0.009628 0.0672554 0.0278857 -0.0268608 -0.0416458 -0.1398621 0.1238784 -0.0197905 -0.021584 0.0270784 0.3537481 0.0262517 -0.0484331 0.0710665 0.1746626 0.0163087 0.0492111 0.0341244 0.0732135 -0.0129367 -0.0609469 -0.0692399 -0.1201806 -0.1053815 -0.0220242 -0.0525108 0.0406052 -0.0444436 -0.022094 0.0532346 0.0777586 0.1053893 0.0414615 0.3450826 -0.0847587 0.1734319 -0.09338 0.2640081 0.052652 0.1554762 0.0704786 0.2142203 unknown
polarizability: 94.1551856|3.9698316|64.1509678|0.3775659|-5.9140536|60.8731956 unknown
InChI: InChI=1S/C5H11NO3/c1-4(2)9-5(8)6-3-7/h4,6-7H,3H2,1-2H3
charge 0 multiplicity 1
20 atoms
O  -0.816252 0.4096 -0.523878
O  3.327992 -0.729464 -0.207143
O  0.545933 -0.476218 1.194863
N  1.435462 0.783446 -0.56254
C  -2.030146 -0.245108 0.086213
C  -3.214645 0.610898 -0.366612
C  -2.098566 -1.706034 -0.379251
C  0.398369 0.181911 0.12546
C  2.801837 0.623738 -0.060042
H  -1.898272 -0.203146 1.183345
H  -4.1515 0.21224 0.062798
H  -3.09395 1.655793 -0.033658
H  -3.304859 0.602633 -1.467168
H  -2.997936 -2.192782 0.040755
H  -1.213322 -2.267091 -0.035651
H  -2.156162 -1.760908 -1.480944
H  1.254347 1.139423 -1.50154
H  2.815241 0.930141 1.002748
H  3.467741 1.26569 -0.654577
H  2.847488 -1.309863 0.439621
