program: Gaussian 09
title: 000084340
version: EM64L-G09RevD.01
frameworkgroup: C1[X(C19H15N3)]
method: RPBEPBE
basis: SDD
operation: Freq
keyword: #pfreq=noraman
keyword: PBEPBE/SDD
title: #p freq=noraman PBEPBE/SDD
converged: YES YES NO NO
title: Mulliken charges:
elementType: N N N C C C C C C C C C C C C C C C C C C C H H H H H H H H H H H H H H H
charge: -0.084535 -0.028145 -0.076711 -0.064718 0.378734 0.300911 0.349380 -0.378754 -0.345520 -0.368449 -0.400971 -0.373815 -0.363421 -0.226180 -0.249450 -0.250362 -0.248562 -0.238007 -0.256920 -0.243582 -0.238522 -0.242203 0.256289 0.250019 0.260820 0.270191 0.283992 0.263902 0.228016 0.226696 0.228615 0.229320 0.227566 0.232644 0.231237 0.228522 0.231972
chargesum: 0.00000
title: Mulliken charges with hydrogens summed into heavy atoms:
elementType: N N N C C C C C C C C C C C C C C C C C C C
charge: -0.084535 -0.028145 -0.076711 -0.064718 0.378734 0.300911 0.349380 -0.122465 -0.095501 -0.107628 -0.130781 -0.089824 -0.099518 0.001835 -0.022754 -0.021747 -0.019242 -0.010441 -0.024276 -0.012345 -0.010000 -0.010230
polarizability: 2.30985579e+02 -1.45674066e+01 2.28639398e+02 1.59363908e+00 5.20335957e+00 1.88660631e+02
1716.lowfreq: -7.5932 -2.5851 -0.0003 0.0004 0.0006 4.2774 14.3610 40.5306 51.3681
frequency: 14.2111 40.5283 51.3596 55.0750 67.5884 80.3838 90.0452 116.7834 201.2519 215.9244 238.2332 271.2388 273.7800 300.0420 301.4584 332.5987 387.3896 402.5399 404.1163 412.1724 486.0839 490.8775 505.3685 524.8475 609.5940 614.9390 617.1166 619.2354 626.3101 652.4232 690.8528 703.8249 707.8889 711.1999 759.1936 764.8556 773.8054 854.7939 857.8112 861.7150 878.0441 890.5230 911.0199 936.9222 940.5301 948.5032 982.6815 985.2184 988.9582 990.2896 990.9805 991.6080 999.6251 1000.4277 1001.8684 1027.6710 1030.6437 1031.4186 1083.9176 1089.0434 1091.3317 1148.2510 1172.2781 1173.8300 1174.8930 1190.6983 1193.9585 1197.2482 1197.9396 1206.5846 1239.7076 1315.3735 1319.0467 1326.3638 1373.9118 1378.7517 1379.7957 1431.5468 1434.0448 1438.6836 1477.8179 1479.7420 1481.0857 1586.0879 1590.3888 1590.9300 1607.3991 1608.0096 1611.9516 2034.3404 3124.8759 3125.0713 3125.9134 3131.9628 3133.6131 3135.1441 3144.2301 3145.8545 3148.3192 3151.7842 3156.9740 3160.1983 3165.8796 3167.9181 3171.3961
redmass: 3.9605 5.3344 5.8986 4.7998 4.9724 5.2300 4.2144 7.1481 5.7072 4.9761 4.9885 5.8990 4.6871 5.7976 6.3093 5.3218 6.7630 2.8545 2.8521 2.9094 6.4983 5.0107 4.4065 3.7325 6.7163 6.3186 6.3504 6.5967 5.5812 6.3561 6.3712 1.7997 1.7115 1.7957 1.8151 2.0475 1.9915 1.2517 1.2720 1.3477 3.5139 3.2216 3.2235 1.5445 1.6547 1.9119 1.4015 1.3835 1.6403 5.8354 6.1401 3.5590 1.3174 1.3210 1.3049 2.4468 2.1623 2.1272 1.6028 1.6050 1.6010 3.1774 1.0515 1.0564 1.0529 1.1968 1.2963 2.3611 1.1237 3.9708 11.8185 1.3710 1.3506 1.3212 6.5946 8.8714 8.9201 2.2169 2.2348 2.2514 2.1547 2.1526 2.2009 5.9071 6.2475 6.2421 6.0108 5.9992 6.0864 13.9702 1.0847 1.0847 1.0848 1.0876 1.0881 1.0884 1.0921 1.0930 1.0934 1.0960 1.0954 1.0968 1.1015 1.1005 1.0979
irintensity: 0.0885 0.1006 0.1232 0.4303 0.1459 0.7814 0.2029 0.1043 0.4223 0.0658 0.9834 0.6944 0.1900 1.7154 3.7385 1.4446 1.2891 0.2115 0.1223 0.0225 0.6602 4.4004 5.8136 0.7747 6.5274 0.8206 0.6539 1.8924 29.0077 32.2522 1.5424 47.5718 92.3961 24.1675 51.9978 46.2037 41.2727 0.2283 0.6671 1.0364 17.4111 13.4883 13.9831 3.1904 0.0664 2.1300 0.0195 0.3169 0.3691 1.1528 1.5574 0.4422 0.0591 0.1124 0.1900 0.8104 9.7761 10.7316 1.5540 6.0930 7.5124 3.2507 0.3563 0.1507 0.2681 7.7304 13.4944 7.8858 1.6982 29.5494 77.2778 3.3523 1.8921 0.8498 0.5717 0.5037 0.3963 9.0939 16.9852 13.8129 17.7730 17.1792 25.4753 0.1589 1.0419 0.3555 6.0732 4.7745 2.4479 342.9648 1.8161 0.3438 0.9925 1.7082 4.9703 7.9917 24.3874 16.7957 27.8516 24.1344 20.0869 25.2305 25.7687 16.7653 9.6160
temp: 298.150 k
press: 1.00000 atm
elementType: 7 7 7 6 6 6 6 6 6 6 6 6 6 6 6 6 6 6 6 6 6 6 1 1 1 1 1 1 1 1 1 1 1 1 1 1 1
symmnumber: 1
zpe: 753829.7 jmol-1
zpe.correction: 0.287119 hartree
zpe.thermalcorrener: 0.305153 hartree
zpe.thermalcorrenthalpy: 0.306097 hartree
zpe.thermalcorrgfe: 0.239071 hartree
zpe.sumelectzpe: -895.707881 hartree
zpe.sumelectthermal: -895.689847 hartree
zpe.sumelectthermalent: -895.688903 hartree
zpe.sumelectthermalfe: -895.755928 hartree
dipole: 0.8756 -0.4143 -2.6456
dipole: 2.8173
quadrupole: -121.8435 -115.9499 -127.9491
quadrupole: 0.9091 8.1143 -2.5229
quadrupole: 0.0707 5.9643 -6.0349 0.9091 8.1143 -2.5229
hfenergy: -895.9949993 hartree
pointgroup: C01 [X(C19H15N3)]
dipole: 0.2205993 -0.1696744 1.0729133 debye
polarizability: 238.1640574|-11.0713151|221.100151|7.9107167|-0.0337014|189.0213999 unknown
InChI: InChI=1S/C19H15N3/c20-22-21-19(16-10-4-1-5-11-16,17-12-6-2-7-13-17)18-14-8-3-9-15-18/h1-15H
charge 0 multiplicity 1
37 atoms
N  0.076516 0.016542 -1.972119
N  -0.775256 0.739535 -2.560467
N  -1.498371 1.359821 -3.26938
C  0.085042 -0.000633 -0.429321
C  -1.249274 -0.603506 0.083117
C  1.246724 -0.950743 -0.05275
C  0.339734 1.450485 0.0512
C  -1.873488 -1.645664 -0.649476
C  1.382793 -1.386452 1.289729
C  1.635805 1.885279 0.424721
C  -1.814447 -0.211219 1.322563
C  2.204987 -1.367161 -1.006938
C  -0.713615 2.404969 0.017112
C  -3.045566 -2.264749 -0.166285
C  2.455022 -2.221662 1.668529
C  1.871193 3.234123 0.771981
C  -2.985227 -0.834524 1.809854
C  3.276391 -2.208966 -0.629278
C  -0.477171 3.753318 0.358196
C  -3.608438 -1.861535 1.066862
C  3.407848 -2.639123 0.709712
C  0.81718 4.174452 0.740767
H  -1.434109 -1.97167 -1.598568
H  0.646927 -1.081515 2.041089
H  2.463312 1.169882 0.44724
H  -1.347097 0.588088 1.907292
H  2.100259 -1.033779 -2.042848
H  -1.725225 2.09623 -0.269014
H  -3.517255 -3.063372 -0.749625
H  2.543174 -2.550361 2.710105
H  2.879277 3.54964 1.063169
H  -3.409319 -0.514838 2.76835
H  4.006996 -2.525312 -1.382254
H  -1.302694 4.472703 0.323822
H  -4.518596 -2.342112 1.442433
H  4.237394 -3.292108 1.003182
H  1.001472 5.220838 1.008298
