program: Gaussian 09
title: 000084253
version: EM64L-G09RevD.01
frameworkgroup: C1[X(C5H9NO2)]
method: RPBEPBE
basis: SDD
operation: Freq
keyword: #pfreq=noraman
keyword: PBEPBE/SDD
title: #p freq=noraman PBEPBE/SDD
converged: NO YES NO YES
title: Mulliken charges:
elementType: O O N C C C C C H H H H H H H H H
charge: -0.297343 -0.295635 -0.660771 0.475867 -0.488463 -0.747942 0.241640 -0.506983 0.240343 0.267705 0.267670 0.186087 0.316330 0.310795 0.233437 0.233451 0.223811
chargesum: 0.00000
title: Mulliken charges with hydrogens summed into heavy atoms:
elementType: O O N C C C C C
charge: -0.297343 -0.295635 -0.033646 0.475867 -0.248120 -0.026479 0.241640 0.183716
polarizability: 1.16563097e+02 2.46683509e+00 6.71750298e+01 7.23961336e-03 4.32638221e-03 4.01757284e+01
1716.lowfreq: -85.2689 -9.6553 -4.2184 -0.0009 -0.0009 -0.0006 16.2888 82.6103 94.6191
frequency: -85.0452 82.6037 94.6063 121.1995 153.4586 218.0345 290.5771 350.8766 381.8824 422.1652 502.0348 503.8447 575.2916 678.6672 697.7672 834.4550 847.8352 885.0280 990.9497 1015.0113 1039.9292 1083.2682 1111.5957 1119.4303 1147.6870 1342.0576 1397.8735 1405.8123 1427.6815 1440.1500 1448.9638 1465.3195 1467.4924 1605.1304 1628.9786 1650.5980 2992.9256 2996.6369 3088.2280 3097.7679 3100.3556 3133.2805 3148.3193 3546.7049 3690.5428
redmass: 1.0169 3.3051 1.4168 2.2461 3.5597 4.6506 4.0825 4.0102 4.4586 1.1017 1.4143 2.7779 1.6728 5.3827 5.3270 1.4988 3.9812 5.8835 3.3740 1.4396 1.5351 2.1459 1.2641 1.8185 1.4500 2.6452 1.9391 1.1981 1.2856 1.0437 1.0508 1.2458 1.0540 8.5072 2.3844 1.6770 1.0299 1.0382 1.1037 1.0996 1.0965 1.1038 1.0907 1.0455 1.1034
irintensity: 0.5047 5.0570 5.0076 3.6523 3.8302 1.3200 18.0457 4.5666 1.3823 130.0098 134.4446 0.2024 33.5210 8.3588 1.4777 68.8179 1.1869 39.6104 65.1047 45.6610 7.2333 151.3552 0.2188 257.4707 4.8963 37.6081 34.5081 27.7291 43.5625 16.6373 12.1515 20.4088 19.1875 268.2267 184.7665 461.0044 55.0638 27.0608 37.0243 23.4616 5.3566 25.0628 10.3600 76.5642 23.5427
temp: 298.150 k
press: 1.00000 atm
elementType: 8 8 7 6 6 6 6 6 1 1 1 1 1 1 1 1 1
symmnumber: 1
zpe: 360213.6 jmol-1
zpe.correction: 0.137198 hartree
zpe.thermalcorrener: 0.146124 hartree
zpe.thermalcorrenthalpy: 0.147068 hartree
zpe.thermalcorrgfe: 0.103373 hartree
zpe.sumelectzpe: -400.495240 hartree
zpe.sumelectthermal: -400.486314 hartree
zpe.sumelectthermalent: -400.485370 hartree
zpe.sumelectthermalfe: -400.529065 hartree
dipole: -3.4882 -1.6813 0.0000
dipole: 3.8722
quadrupole: -28.7516 -48.5038 -50.0037
quadrupole: 2.2388 0.0003 0.0002
quadrupole: 13.6681 -6.0841 -7.5840 2.2388 0.0003 0.0002
hfenergy: -400.6324382 hartree
pointgroup: C01 [X(C5H9N1O2)]
dipole: 1.3863175 -0.6317072 -0.0000044 debye
dipolederiv: -1.6226269 -0.2300788 -0.000152 -0.5385939 -0.591551 -0.0000211 -0.0001475 -0.0000213 -0.3196247 -0.7499142 0.1071189 -0.0000619 0.2259374 -1.0481907 0.0000648 -0.0000709 0.0001826 -0.3317101 -1.3982525 0.2887933 -0.000212 0.7276455 -0.405235 -0.0000195 -0.0004918 -0.0000403 -0.6959988 1.9110373 -0.2420866 0.0002285 -0.1160796 0.5049035 -0.0000459 0.0003 -0.0000085 0.1405848 -1.544803 0.2114119 -0.0001592 -0.0996813 -0.1337885 -0.0000368 0.000004 -0.0000266 -0.3712041 0.1476135 0.0314985 -0.0000636 -0.0402635 -0.2548669 0.0000261 -0.00019 -0.0000111 0.007089 2.2621231 0.0333292 0.0002251 -0.0040965 1.2679585 -0.0000668 0.0002775 -0.0001546 0.2380927 0.7509246 -0.0010818 0.0001041 -0.1156958 0.2333791 -0.0000367 0.0000826 -0.0000248 0.2892871 0.0536243 0.0114947 -0.0000036 0.0271612 -0.0990475 0.0000477 -0.0000161 0.0000464 0.1980209 0.0658225 0.0212812 -0.0794586 -0.0196947 0.0700354 0.0346524 -0.0413487 0.0544771 0.001917 0.0657958 0.0212267 0.0794073 -0.0197628 0.0699557 -0.0346927 0.0413228 -0.0545264 0.0017959 -0.2158286 -0.0923519 0.0001104 0.0027837 0.0658086 0.0000036 0.0001045 0.0000386 0.1139969 0.1670258 -0.0336302 0.0000123 -0.0963676 0.1254882 0.0000357 0.0000694 0.0000057 0.3867026 0.2177798 -0.0388275 0.0000368 -0.0081524 0.1696385 0.0000676 0.0001575 0.0000549 0.3753068 -0.0221047 0.0021042 0.0039849 0.1151246 0.0296827 0.1104006 -0.0548042 0.0941154 -0.0756566 -0.022043 0.0021128 -0.0040145 0.115184 0.0295457 -0.1104362 0.0547117 -0.0941672 -0.0754558 -0.0661739 -0.0923146 0.0000159 -0.1554483 -0.0337163 0.0000571 0.000039 0.0000601 0.1168564 unknown
polarizability: 116.6465376|-1.3990535|67.0915893|0.0073313|-0.0041692|40.1757284 unknown
InChI: InChI=1S/C5H9NO2/c1-4(6)3-5(7)8-2/h3H,6H2,1-2H3
charge 0 multiplicity 1
17 atoms
O  -1.918539 -0.840403 -0.000442
O  -0.9781 1.304665 -0.00063
N  2.82857 -0.898937 0.000004
C  1.684061 -0.118968 -0.000223
C  0.427407 -0.70764 -0.000171
C  1.920803 1.378433 -0.000469
C  -0.811144 0.048227 -0.000335
C  -3.239589 -0.185187 -0.000759
H  0.329463 -1.798109 -0.000008
H  1.4428 1.845581 -0.87705
H  1.443442 1.845754 0.876376
H  3.000046 1.616021 -0.000861
H  2.769251 -1.915267 0.000146
H  3.750012 -0.470352 -0.000265
H  -3.36254 0.44719 -0.897346
H  -3.362628 0.447903 0.89531
H  -3.965314 -1.011812 -0.000477
