program: Gaussian 09
title: 000084227
version: EM64L-G09RevD.01
frameworkgroup: C1[X(C2H6N2O2)]
method: RPBEPBE
basis: SDD
operation: Freq
keyword: #pfreq=noraman
keyword: PBEPBE/SDD
title: #p freq=noraman PBEPBE/SDD
converged: YES YES NO NO
title: Mulliken charges:
elementType: O O N N C C H H H H H H
charge: -0.407841 -0.249280 -0.322198 -0.579650 -0.367272 0.191723 0.262274 0.227902 0.290883 0.269708 0.304448 0.379302
chargesum: 0.00000
title: Mulliken charges with hydrogens summed into heavy atoms:
elementType: O O N N C C
charge: -0.028538 -0.249280 -0.031315 -0.005494 0.122903 0.191723
polarizability: 5.77286236e+01 2.24285716e-01 4.21675895e+01 -1.10735424e+00 -5.81768663e-02 2.92592684e+01
1716.lowfreq: -6.4250 -4.7453 -0.0003 0.0011 0.0011 10.8419 68.4122 98.9870 187.8494
frequency: 68.3176 98.9621 187.8493 321.4203 397.6735 421.3506 450.2777 501.2178 594.7572 639.0130 665.6821 880.3649 988.4948 1035.7378 1121.0381 1163.7043 1194.2744 1245.3383 1261.4862 1356.3221 1460.8011 1481.0620 1654.5662 1662.2968 2886.9053 3042.7583 3414.4906 3419.7246 3511.5438 3592.5149
redmass: 2.9765 2.6400 5.0173 1.6127 3.4727 1.7446 1.7327 1.8917 4.1012 1.4651 1.3118 3.9504 1.9237 2.6948 2.7675 1.1293 2.1030 1.7634 1.5609 1.9306 1.1003 1.1493 1.3365 3.3386 1.0717 1.0864 1.0743 1.0480 1.0639 1.0975
irintensity: 3.0858 6.7995 6.8388 61.6247 31.9749 92.1955 138.4849 16.0978 28.5613 153.8024 128.1080 5.9868 3.9893 234.6685 49.0352 9.1024 2.9736 0.3168 9.5696 47.4023 31.5327 9.2708 75.7747 154.7829 60.8034 20.9388 1.0372 15.4772 20.8882 2.7071
temp: 298.150 k
press: 1.00000 atm
elementType: 8 8 7 7 6 6 1 1 1 1 1 1
symmnumber: 1
zpe: 243559.4 jmol-1
zpe.correction: 0.092767 hartree
zpe.thermalcorrener: 0.099865 hartree
zpe.thermalcorrenthalpy: 0.100809 hartree
zpe.thermalcorrgfe: 0.061565 hartree
zpe.sumelectzpe: -339.226387 hartree
zpe.sumelectthermal: -339.219289 hartree
zpe.sumelectthermalent: -339.218344 hartree
zpe.sumelectthermalfe: -339.257588 hartree
dipole: -0.4799 -0.3201 1.1596
dipole: 1.2952
quadrupole: -24.6668 -41.3143 -34.8662
quadrupole: -3.5578 -1.5598 0.5635
quadrupole: 8.9490 -7.6986 -1.2504 -3.5578 -1.5598 0.5635
hfenergy: -339.3191536 hartree
pointgroup: C01 [X(C2H6N2O2)]
dipole: -0.1732788 -0.2554418 0.4054497 debye
dipolederiv: -0.9480034 0.4966568 0.237682 0.4493511 -0.5927347 -0.0990277 0.2275429 -0.0943087 -0.4772602 -0.6464422 -0.1528726 -0.0219968 0.0920945 -0.9367919 -0.2189044 0.0781883 -0.2078904 -0.4003476 -0.0119109 0.2094106 0.0179846 -0.0271552 -0.2140078 0.2500758 -0.1628673 0.2037411 -0.4468231 -0.1546124 0.0806272 -0.0783751 0.1083012 -0.6690484 -0.2464801 0.098275 -0.1967265 -0.019173 0.0278252 -0.323517 0.0317226 -0.4513829 0.1649739 -0.0982055 -0.0340211 -0.0574894 0.3531321 1.3698049 -0.1183447 -0.1783568 -0.204944 1.2896501 0.3965896 -0.2595215 0.385346 0.3673092 0.0590265 0.0247941 0.005868 0.0824723 0.0214758 -0.07544 0.0266348 -0.1048533 -0.0406286 -0.0089312 0.0232365 -0.0055811 0.0955887 -0.0555247 0.1092818 -0.0459209 0.160287 -0.0730204 0.0811804 -0.0870781 -0.0162026 -0.0182744 0.1369334 -0.1025683 -0.0115144 -0.1771821 0.2105329 -0.0008796 -0.0487116 0.0652128 -0.0546132 0.3401327 0.0110552 0.1229194 0.0581414 -0.0293008 0.0255003 -0.0011917 -0.0315948 0.0761503 0.2958608 0.1303405 0.006577 0.0955978 0.1759239 0.2074423 -0.1030094 -0.0263629 -0.1475883 0.2190807 -0.056717 -0.0462922 -0.0646631 0.3796557 unknown
polarizability: 57.595307|0.535432|41.0207254|-2.1894124|3.6487353|30.5394491 unknown
InChI: InChI=1S/C2H6N2O2/c3-4-1-2(5)6/h4-5H,1,3H2
charge 0 multiplicity 1
12 atoms
O  2.084044 -0.81662 -0.281972
O  1.239754 1.199513 0.509559
N  -1.377737 0.344729 0.021104
N  -2.666702 -0.198897 0.228341
C  -0.304267 -0.656885 -0.004276
C  1.042285 0.031722 0.103682
H  -0.342349 -1.253071 -0.932751
H  -0.363772 -1.389872 0.837696
H  -1.13154 1.184829 0.563976
H  -2.994041 -0.301045 1.196493
H  -3.363686 0.131426 -0.439114
H  2.953911 -0.346629 -0.162237
