program: Gaussian 09
title: 000084229
version: EM64L-G09RevD.01
frameworkgroup: C1[X(C9H10O4)]
method: RPBEPBE
basis: SDD
operation: Freq
keyword: #pfreq=noraman
keyword: PBEPBE/SDD
title: #p freq=noraman PBEPBE/SDD
converged: YES YES NO NO
title: Mulliken charges:
elementType: O O O O C C C C C C C C C H H H H H H H H H H
charge: -0.264464 -0.384351 -0.454669 -0.218650 0.371294 0.170823 -0.452343 0.160116 -0.327322 -0.381361 -0.243552 -0.684197 0.112413 0.304564 0.250769 0.217559 0.206147 0.206227 0.207119 0.233869 0.233909 0.354483 0.381619
chargesum: 0.00000
title: Mulliken charges with hydrogens summed into heavy atoms:
elementType: O O O O C C C C C C C C C
charge: -0.264464 -0.029869 -0.073050 -0.218650 0.371294 0.170823 -0.147779 0.160116 -0.076553 -0.163801 0.168822 -0.009300 0.112413
polarizability: 1.69009692e+02 2.41639379e-01 1.26337943e+02 7.37780408e-03 -1.06883893e-02 5.48509053e+01
1716.lowfreq: -5.1205 -0.0002 0.0004 0.0008 6.6714 9.5574 29.8048 57.0700 95.7758
frequency: 29.7966 57.0457 95.7744 117.4163 132.5524 176.5997 208.4279 244.5117 304.5788 309.5011 359.9749 377.4488 380.1458 396.6095 426.5610 503.2477 538.9215 571.6654 587.8973 617.4850 689.9510 708.5363 745.0685 762.2291 795.6877 830.0489 848.0080 906.8356 934.6636 940.5729 985.0649 1039.2589 1094.9946 1117.6090 1136.2314 1136.9196 1173.7404 1217.9892 1257.2436 1261.6642 1288.2827 1303.2153 1360.8037 1394.5930 1405.3305 1417.2425 1461.2035 1477.2582 1487.1604 1498.4497 1591.7508 1620.8621 1656.1082 2948.0648 2998.2467 3005.3109 3095.2499 3107.6117 3117.3389 3165.7487 3195.5216 3534.7656 3552.7339
redmass: 11.6609 4.3387 2.1135 4.1674 3.2012 4.7619 5.7522 1.2112 4.1339 6.0142 5.3260 8.1642 1.1578 5.8049 3.1305 4.3640 2.3170 5.9020 1.3793 4.8958 4.3990 6.0750 5.1200 4.1081 1.5995 1.1064 4.3332 1.4311 1.4199 3.8399 3.6931 2.8203 2.0300 2.1756 1.4363 1.4542 1.1814 2.7063 3.2456 1.1422 1.4152 2.8553 1.4744 2.0514 1.8377 4.4604 1.0395 1.0797 1.2541 1.9870 6.6126 7.1941 8.6009 1.0552 1.0363 1.1075 1.0988 1.1013 1.0895 1.0940 1.0919 1.0642 1.0659
irintensity: 1.3411 2.0888 4.5054 0.2214 0.7827 0.5509 1.0095 0.2299 3.2163 5.5920 10.5760 1.2857 118.2187 5.1422 13.5282 29.8268 0.0053 7.0565 161.5242 32.1279 15.2069 15.5602 30.4574 1.7552 65.4819 0.2112 29.5097 3.0483 17.1132 71.4840 202.7547 121.0542 58.0156 4.7230 4.9711 267.2903 28.3714 141.8872 6.5909 0.0097 120.8582 101.8937 38.4475 51.1490 6.8184 25.9173 12.0495 26.2494 68.5268 90.1413 69.3321 61.7434 239.4119 42.6890 24.5439 41.0101 28.3557 33.2315 18.2963 10.3818 4.4521 39.2322 33.5448
temp: 298.150 k
press: 1.00000 atm
elementType: 8 8 8 8 6 6 6 6 6 6 6 6 6 1 1 1 1 1 1 1 1 1 1
symmnumber: 1
zpe: 458775.8 jmol-1
zpe.correction: 0.174738 hartree
zpe.thermalcorrener: 0.187452 hartree
zpe.thermalcorrenthalpy: 0.188396 hartree
zpe.thermalcorrgfe: 0.134888 hartree
zpe.sumelectzpe: -648.876040 hartree
zpe.sumelectthermal: -648.863326 hartree
zpe.sumelectthermalent: -648.862382 hartree
zpe.sumelectthermalfe: -648.915890 hartree
dipole: 4.2380 2.7275 -0.0048
dipole: 5.0399
quadrupole: -76.8082 -59.3317 -77.9691
quadrupole: 4.0882 0.0199 -0.0201
quadrupole: -5.4385 12.0380 -6.5995 4.0882 0.0199 -0.0201
hfenergy: -649.0507784 hartree
pointgroup: C01 [X(C9H10O4)]
dipole: -1.6896575 -1.0357945 -0.0619967 debye
dipolederiv: -1.8917191 0.3002305 -0.0529146 0.4062994 -0.3659721 0.0132799 -0.0528213 0.0098379 -0.2827445 -0.9965482 0.7186927 -0.0172194 0.586037 -0.4135273 0.0203873 -0.018685 0.0253622 -0.377081 -0.3038548 0.0974991 0.0047613 -0.0681789 -1.358807 -0.0052749 0.0042917 0.0003851 -0.4340886 -1.1343058 -0.0031639 -0.0275909 -0.1293868 -0.5593241 -0.0051408 -0.0279514 -0.0007807 -0.3158579 1.3004317 -0.559287 0.039471 -0.8889795 -0.0744515 -0.0302515 0.0387983 -0.0191283 0.066436 -0.5156209 -0.5129337 -0.0184585 -0.1141836 -0.2485136 -0.0046172 -0.0167149 -0.0180459 -0.0172552 -0.0875139 0.4541311 0.0026255 -0.1476141 0.0139278 -0.0044022 0.0005252 0.0156142 -0.1195212 0.9004444 -0.7441567 0.0247836 -0.3226221 0.3277169 -0.0099008 0.0265485 -0.0241228 0.0605078 -0.1200554 -0.2002783 0.0006871 0.3510614 0.1156295 0.0127407 0.0024099 -0.0056679 -0.1641155 -0.2702386 0.3718229 -0.0013448 -0.148441 0.1187536 -0.0040114 -0.0033625 0.0134732 -0.1858317 1.0920292 -0.0167494 0.0229154 0.3550832 0.2477843 0.0112796 0.0239932 -0.0010744 0.4064592 -0.1159927 0.0927171 -0.0053952 0.0606325 0.0213882 0.0022695 -0.0057158 0.0033028 0.0520497 1.5866893 0.2796093 0.0464384 0.4016558 1.7329716 0.0183391 0.0468035 0.0141635 0.2350725 0.150443 0.0321286 -0.000433 0.0356638 0.0560456 0.0007583 -0.000565 0.0006087 0.1671868 -0.0369249 -0.0858167 -0.0068691 -0.1032236 0.0661336 -0.0037595 -0.0069728 -0.0032765 0.1609884 0.0451902 0.0687309 -0.003838 0.0432609 -0.1181787 0.0004918 -0.0038637 0.0013168 0.1686358 -0.0534253 0.0488918 0.0307838 -0.0981409 -0.0446597 -0.1182399 -0.0181677 -0.1178535 -0.094961 -0.052799 0.0410852 -0.0276817 -0.106066 -0.0458326 0.1116481 0.0204498 0.1211669 -0.09444 -0.144096 -0.0701357 -0.0092442 -0.1108484 0.0229373 -0.0043421 -0.0093895 -0.0029427 0.1145499 0.1129123 -0.014336 -0.0219687 0.0507213 0.0117743 -0.0996771 0.0115908 -0.1132253 -0.0599894 0.1116516 -0.0226333 0.0337535 0.043481 0.0101712 0.103427 0.0008416 0.1123725 -0.0566421 0.3308812 -0.2032721 -0.0028115 -0.1175348 0.1221644 -0.0056113 -0.0018605 -0.0088591 0.3761944 0.0924216 -0.0727766 -0.0104498 0.0213233 0.3618682 0.0006077 -0.0101825 -0.0026268 0.3944476 unknown
polarizability: 168.872584|-0.7142053|126.3473|3.8023114|0.2377613|54.978657 unknown
InChI: InChI=1S/C9H10O4/c1-2-13-6-3-4-8(10)7(5-6)9(11)12/h3-5,10-11H,2H2,1H3
charge 0 multiplicity 1
23 atoms
O  -2.407304 0.705927 -0.159659
O  2.615935 -1.85905 -0.001079
O  2.114016 2.411228 -0.002842
O  3.668971 0.694297 0.043869
C  -1.201012 -0.012721 -0.121564
C  1.259072 0.170745 -0.038882
C  -0.026439 0.766595 -0.079424
C  1.354173 -1.256956 -0.040955
C  -1.101667 -1.427036 -0.123094
C  0.170952 -2.031431 -0.082769
C  -3.662514 -0.068956 -0.203876
C  -4.804797 0.942206 -0.239614
C  2.466016 1.038007 0.004534
H  -0.10814 1.855278 -0.0780
H  -1.991784 -2.061456 -0.154837
H  0.244217 -3.126917 -0.083827
H  -3.667607 -0.713713 -1.107718
H  -3.728087 -0.718117 0.694428
H  -5.776533 0.417002 -0.276039
H  -4.785704 1.582698 0.658421
H  -4.722913 1.58991 -1.128936
H  2.523439 -2.845797 -0.010857
H  2.957509 2.936959 0.02742
