program: Gaussian 09
title: 000084190
version: EM64L-G09RevD.01
frameworkgroup: C1[X(C9H9ClN2O)]
method: RPBEPBE
basis: SDD
operation: Freq
keyword: #p
keyword: freq=noraman
keyword: PBEPBE/SDD
title: #p freq=noraman PBEPBE/SDD
converged: NO YES NO NO
title: Mulliken charges:
elementType: Cl O N N C C C C C C C C C H H H H H H H H H
charge: -0.079201 -0.276485 -0.271653 -0.409370 -0.381286 -0.392129 0.451786 0.245318 -0.318047 -0.351270 -0.096904 -0.203058 -0.278485 0.247637 0.244977 0.236198 0.235809 0.334000 0.265640 0.308882 0.231145 0.256496
chargesum: 0.00000
title: Mulliken charges with hydrogens summed into heavy atoms:
elementType: Cl O N N C C C C C C C C C
charge: -0.079201 -0.276485 -0.271653 -0.075370 0.111329 0.079877 0.451786 0.245318 -0.052407 -0.042388 -0.096904 0.028087 -0.021988
polarizability: 1.78910575e+02 -2.96178513e+00 1.33803294e+02 2.21160619e-02 4.91968566e-01 5.55423547e+01
1716.lowfreq: -9.3336 0.0003 0.0013 0.0022 3.6529 5.7418 26.3635 79.6345 92.7614
frequency: 25.9967 79.6204 92.7441 131.9753 182.1355 185.2311 234.7952 269.8105 334.5119 372.6944 410.5791 439.0493 456.3131 542.1869 566.0113 642.0801 683.0728 685.5029 699.2634 713.7227 764.1036 784.7835 841.1588 882.3700 905.1280 956.3703 974.9180 989.6388 1010.2969 1063.4150 1080.0461 1095.4081 1106.4208 1144.2641 1183.8099 1201.8275 1225.7849 1247.5511 1297.9645 1306.4427 1330.3888 1367.2054 1394.7147 1403.3305 1437.9302 1482.1880 1497.2500 1510.8284 1564.6422 1615.8315 1673.8924 2979.5945 2985.1486 3035.1880 3055.1096 3144.8462 3180.2004 3183.2684 3193.0578 3629.0087
redmass: 4.3507 3.4532 2.9719 7.2204 4.1455 5.3051 10.2766 4.7950 6.4297 6.0070 8.7052 2.8708 1.1108 5.4319 5.3450 6.9071 2.4018 7.4015 9.3814 5.4494 5.7995 1.3060 1.5923 1.2546 1.3650 3.7966 5.8766 1.3074 3.5253 2.4834 2.0036 1.7913 1.5940 4.2067 1.0967 1.1302 1.1758 2.8033 1.3319 1.3648 2.4572 3.7183 2.5302 1.8350 3.0587 2.8051 1.1208 1.0895 6.8105 6.5094 8.1086 1.0593 1.0672 1.0993 1.1054 1.0889 1.0943 1.0918 1.0959 1.0797
irintensity: 7.1173 1.2327 0.6104 4.7422 5.6604 0.0797 3.4496 2.8910 1.6408 3.0856 8.4334 0.3002 158.5522 9.7780 0.6657 4.5004 22.8341 25.4562 10.9950 35.5209 10.4697 60.3553 38.5627 4.4288 3.7870 2.0083 21.9576 4.1572 33.4844 38.6070 14.3485 40.0302 6.3427 31.6627 1.4161 2.8986 14.4645 287.5117 51.7105 4.6522 80.6248 61.0418 83.8277 91.4563 40.1750 281.0958 14.5909 4.1153 67.2564 177.3308 357.9757 36.0965 71.7338 17.0122 49.4156 12.5408 4.1796 2.8870 9.4480 82.5102
temp: 298.150 k
press: 1.00000 atm
elementType: 17 8 7 7 6 6 6 6 6 6 6 6 6 1 1 1 1 1 1 1 1 1
symmnumber: 1
zpe: 439463.9 jmol-1
zpe.correction: 0.167383 hartree
zpe.thermalcorrener: 0.178743 hartree
zpe.thermalcorrenthalpy: 0.179687 hartree
zpe.thermalcorrgfe: 0.128499 hartree
zpe.sumelectzpe: -992.225717 hartree
zpe.sumelectthermal: -992.214357 hartree
zpe.sumelectthermalent: -992.213413 hartree
zpe.sumelectthermalfe: -992.264601 hartree
dipole: 3.1041 -3.5728 0.3482
dipole: 4.7456
quadrupole: -76.7322 -78.9444 -85.5767
quadrupole: -18.5141 0.8679 0.4517
quadrupole: 3.6856 1.4734 -5.1590 -18.5141 0.8679 0.4517
hfenergy: -992.3931001 hartree
pointgroup: C01 [X(C9H9Cl1N2O1)]
dipole: 1.3699898 1.2615425 -0.1327844 debye
dipolederiv: -0.5200142 0.3080295 0.0159228 0.4122393 -0.4927248 -0.0201073 0.0206154 -0.0181702 -0.0861072 -0.7111416 0.0364022 0.0009097 0.2112507 -1.1887864 0.0354615 -0.0130724 0.0318238 -0.3661219 -2.1121994 0.0042377 -0.0171411 0.4050411 -0.6688764 0.0008988 -0.0198808 0.0328416 -0.2153473 -1.1981477 -0.3563463 -0.014828 -0.4880745 -0.7098749 0.0210742 -0.1045473 -0.0261082 -0.5455043 0.0744758 0.0670268 0.0006125 0.1116711 0.4900158 0.0307065 0.0116538 0.0266887 0.3235932 0.0405999 -0.0364581 0.0072553 0.2399262 0.5537773 -0.0563034 -0.0098382 -0.032037 0.3937565 1.6575338 0.2375053 -0.0043805 0.3435169 0.1203701 0.0092582 -0.0104968 0.0045629 0.1193068 2.2927504 0.1141306 0.0290729 -0.5039977 1.6025486 -0.054962 0.0720939 -0.0472472 0.2683385 -0.5967656 0.0048788 -0.0002279 0.3469189 -0.1597264 0.0006783 0.0127701 0.0014567 -0.1962296 -0.4219984 -0.0477423 -0.0016373 -0.3665836 -0.1456293 0.0028924 -0.0011055 -0.0047976 -0.1804373 0.829448 -0.3665396 -0.0213856 -0.6206444 0.7924794 0.0381253 -0.0373463 0.0343907 -0.0470634 0.3248322 -0.0694725 -0.0079177 0.0300511 0.1776703 0.0130075 -0.0014143 0.0099295 -0.1367858 -0.3227869 0.1192351 0.0053215 0.2043723 -0.363867 -0.0110871 0.0112527 -0.0095206 -0.1525374 0.0427294 0.0477895 0.0633379 -0.0097107 -0.0398567 -0.0529929 0.0448512 -0.1086702 -0.0800971 0.04494 0.0778801 -0.0639448 0.0160204 -0.038044 0.0534078 -0.0608477 0.0863581 -0.0320531 0.034727 -0.0183127 0.054896 -0.079067 -0.0440649 0.0615156 0.1315951 0.1323027 -0.1179715 0.0192291 -0.0632836 -0.0561336 -0.1139341 -0.0701828 -0.0600455 -0.1012434 -0.1106622 -0.0248445 0.2475866 0.0047833 0.0067033 -0.0222999 0.128308 0.0150962 0.0482674 0.0151002 0.3864437 0.1010349 -0.0529937 -0.0016984 -0.0684467 -0.0309951 -0.0086385 0.0007559 -0.0080851 0.1732751 0.1693275 0.0639115 0.0059154 0.031553 0.0875965 -0.0053981 0.0085521 0.0005619 0.1839976 0.051775 -0.0394965 -0.001037 -0.0571296 -0.099354 -0.0095723 -0.002236 -0.0088174 0.1524727 -0.0479358 -0.0351648 0.0003844 -0.0226727 0.0992166 -0.0030152 -0.0003789 -0.001901 0.1799162 unknown
polarizability: 179.0007545|-2.1167921|133.6921303|-0.7105769|1.2621068|55.5633382 unknown
InChI: InChI=1S/C9H9ClN2O/c10-7-2-1-3-8(6-7)12-5-4-11-9(12)13/h1-3,6,11H,4-5H2
charge 0 multiplicity 1
22 atoms
Cl -3.825105 1.865496 0.108217
O  2.226093 -1.930399 0.099398
N  1.126925 0.213283 -0.016299
N  3.379287 0.13224 0.073965
C  1.558073 1.62944 0.022403
C  3.113716 1.562834 -0.099476
C  -0.241078 -0.151544 -0.007666
C  2.240997 -0.670286 0.057091
C  -1.2277 0.875769 0.043753
C  -0.659951 -1.514095 -0.05439
C  -2.585895 0.51736 0.041987
C  -2.033189 -1.822532 -0.051988
C  -3.027402 -0.814635 -0.005853
H  1.244403 2.102532 0.972776
H  1.112943 2.199748 -0.811946
H  3.453271 1.924222 -1.08924
H  3.604533 2.172174 0.679503
H  4.303059 -0.292224 0.072186
H  -0.955513 1.932083 0.089008
H  0.093886 -2.302551 -0.082916
H  -2.341554 -2.872936 -0.087864
H  -4.0925 -1.05848 -0.006348
