program: Gaussian 09
title: 000084187
version: EM64L-G09RevD.01
frameworkgroup: C1[X(C9H7ClN2O2)]
method: RPBEPBE
basis: SDD
operation: Freq
keyword: #p
keyword: freq=noraman
keyword: PBEPBE/SDD
title: #p freq=noraman PBEPBE/SDD
converged: NO YES NO NO
title: Mulliken charges:
elementType: Cl O O N N C C C C C C C C C H H H H H H H
charge: -0.056085 -0.374501 -0.444559 -0.179470 -0.144190 0.210742 0.298572 0.119129 -0.318916 -0.375760 -0.280597 -0.216831 -0.132639 -0.203708 0.300319 0.262315 0.274656 0.263194 0.258047 0.371890 0.368392
chargesum: 0.00000
title: Mulliken charges with hydrogens summed into heavy atoms:
elementType: Cl O O N N C C C C C C C C C
charge: -0.056085 -0.002611 -0.076167 -0.179470 -0.144190 0.210742 0.298572 0.119129 -0.018596 -0.113445 -0.005941 0.046363 -0.132639 0.054338
polarizability: 1.86429584e+02 -1.00682031e+01 1.80189320e+02 1.94984933e-01 -1.97390103e+00 5.12375909e+01
1716.lowfreq: -9.9561 -0.0011 -0.0007 0.0018 5.2539 6.2246 72.7974 77.7657 127.7802
frequency: 72.7961 77.7494 127.7799 139.9100 158.0520 231.5017 244.3070 282.4416 296.2998 338.4090 351.1585 378.4496 388.4044 428.6714 438.8710 482.5384 526.4630 537.5035 597.3285 624.7389 651.3353 701.5249 726.3198 753.2901 783.4292 811.6132 825.1476 885.4051 916.3871 930.9139 946.0359 988.1984 1059.3257 1077.2286 1125.6628 1144.8543 1187.9430 1229.6565 1253.4038 1324.4177 1331.8247 1353.1889 1382.2537 1386.8908 1439.6657 1461.4782 1534.6873 1560.2319 1605.7666 1624.6023 3165.5376 3178.4349 3185.8359 3189.6153 3217.0099 3443.6959 3582.9058
redmass: 5.6334 5.9143 5.3615 10.5845 6.7961 7.5949 8.1561 6.6691 2.0820 1.6312 9.0194 7.8908 1.9817 1.7742 5.5937 3.7542 5.4240 4.0284 7.2673 6.4675 4.0576 7.0185 3.3892 5.6265 1.6848 1.4179 5.7299 10.3099 1.4011 1.2559 1.3323 5.0925 3.0094 2.5296 2.1010 1.3109 1.6452 1.4591 1.3265 1.4544 1.9492 2.5241 9.4457 1.9604 6.9853 3.2370 5.7554 7.7150 7.7684 7.3117 1.0885 1.0928 1.0969 1.0891 1.0973 1.0687 1.0675
irintensity: 1.0057 1.0430 0.9300 0.0682 2.5168 0.1117 3.2012 13.2809 47.1553 97.8019 3.6503 9.3080 91.4911 38.8111 4.5175 5.0298 1.3202 18.7822 27.1220 22.9935 2.3269 17.4654 3.6221 6.0684 45.4253 63.0490 41.2287 173.5301 13.5613 1.6834 3.4724 51.6685 33.6403 30.9382 3.1821 3.4085 8.6731 86.4189 12.1456 21.9308 39.7512 34.6824 32.5895 49.3086 73.3243 93.0999 40.3986 12.1145 2.6069 81.8269 0.7573 1.7618 3.2499 1.8846 2.1742 15.9814 76.5001
temp: 298.150 k
press: 1.00000 atm
elementType: 17 8 8 7 7 6 6 6 6 6 6 6 6 6 1 1 1 1 1 1 1
symmnumber: 1
zpe: 380945.4 jmol-1
zpe.correction: 0.145094 hartree
zpe.thermalcorrener: 0.157360 hartree
zpe.thermalcorrenthalpy: 0.158304 hartree
zpe.thermalcorrgfe: 0.106451 hartree
zpe.sumelectzpe: -1066.073258 hartree
zpe.sumelectthermal: -1066.060993 hartree
zpe.sumelectthermalent: -1066.060048 hartree
zpe.sumelectthermalfe: -1066.111901 hartree
dipole: -2.1106 -3.2673 1.4917
dipole: 4.1660
quadrupole: -86.8201 -71.1100 -90.4170
quadrupole: 0.1041 -2.7716 -6.1797
quadrupole: -4.0378 11.6724 -7.6346 0.1041 -2.7716 -6.1797
hfenergy: -1066.2183525 hartree
pointgroup: C01 [X(C9H7Cl1N2O2)]
dipole: -0.5329727 1.4221707 -0.616236 debye
dipolederiv: -0.6950321 0.2958911 -0.0131404 0.42325 -0.324586 0.0091877 -0.0156277 0.0082121 -0.0690239 -0.44225 0.0575417 -0.0339512 0.1106842 -0.5216907 0.032567 -0.0315382 -0.0832704 0.088558 -1.192518 -1.0959792 0.0129496 -0.340392 -0.3438508 0.0080319 0.0245625 0.0289237 -0.3958325 -0.9327905 -0.2350643 0.033496 0.1148575 0.0117001 0.0263601 0.0533145 0.3074947 -0.1652106 0.6501732 0.9783655 -0.0221296 0.1275174 -0.2883044 0.000492 -0.0314563 -0.0254616 -0.2234984 0.0597408 -0.1094681 0.0020858 0.212086 0.0101709 0.004404 -0.0126713 -0.0159653 0.0022942 0.533884 -0.4718828 0.0480172 -0.5507302 0.046567 -0.0416014 0.0269949 -0.1085484 0.0755074 0.0712247 -0.1423535 0.0097016 0.0259116 0.4327428 0.0105534 0.0192549 0.0224619 0.0725744 -0.2513784 0.2058459 -0.00404 0.0614826 -0.10185 -0.0014844 -0.000664 0.0078259 -0.0810371 -0.0262847 0.2141413 -0.0162921 0.0027798 0.0242197 0.0113311 -0.0062123 0.0451966 -0.1865943 -0.0408562 0.1575826 -0.0125494 -0.3364216 -0.5670878 0.0178775 -0.0019965 -0.0283061 -0.1847632 0.7562885 0.6722495 -0.0829387 0.5024242 0.4773211 -0.0561316 -0.0893673 -0.1495537 -0.0460017 0.8491624 -0.6080353 0.021826 -0.7536959 0.3022066 -0.0112844 0.0236431 -0.0136601 -0.0791575 -0.2199751 0.0144556 0.0078315 0.2917613 0.090175 -0.0028709 0.0048322 -0.0008767 -0.1052082 0.1319636 -0.0322607 0.0012264 0.0169823 0.0412931 0.0032578 -0.0011248 -0.0019557 0.1587619 0.094552 0.0202799 -0.0031556 -0.0199044 -0.0370126 0.0038683 -0.0096238 -0.0010988 0.1757432 0.01118 0.0227037 0.0074525 -0.041824 0.0886389 0.0038527 -0.0072247 0.0110037 0.1834699 0.0480646 0.0461269 0.0046677 0.0766162 0.04043 0.002408 0.0121498 0.0133571 0.170665 -0.0280586 -0.0545 -0.0045371 -0.0423168 0.0873764 -0.0006077 -0.0028811 -0.0013805 0.1648894 0.3315859 -0.0587162 0.0403437 -0.0344777 0.3070211 -0.0142886 0.0402813 -0.0109305 0.0564138 0.2913239 0.1230765 0.003136 0.1534096 0.2245196 -0.0059222 0.0053548 -0.0034679 0.3874501 unknown
polarizability: 190.3539523|7.8548254|176.1564141|0.0059556|-4.1561256|51.3461289 unknown
InChI: InChI=1S/C9H7ClN2O2/c10-6-1-2-9-7(5-6)8(11-13)3-4-12(9)14/h1-5,13-14H
charge 0 multiplicity 1
21 atoms
Cl 3.912576 -1.731972 0.046075
O  -0.775048 3.271841 0.030057
O  -2.884207 -2.662099 0.013944
N  -0.936845 1.84727 -0.148634
N  -1.458442 -2.286863 -0.023688
C  0.021239 -0.388839 -0.032485
C  0.211243 1.031675 -0.066908
C  -1.349065 -0.954118 -0.016317
C  1.170479 -1.221246 0.00008
C  1.512736 1.593491 -0.038355
C  -2.458541 -0.007728 0.02998
C  -2.227577 1.346659 -0.017065
C  2.447489 -0.646681 0.008212
C  2.639887 0.752482 -0.001794
H  1.028437 -2.304588 0.023586
H  1.635818 2.678771 -0.016174
H  -3.477971 -0.388394 0.093307
H  -3.015486 2.101263 0.024426
H  3.647768 1.175434 0.025709
H  -0.662006 3.639001 -0.892137
H  -2.831883 -3.651057 0.004281
