program: Gaussian 09
title: 000084180
version: EM64L-G09RevD.01
frameworkgroup: C1[X(C9H10ClNO)]
method: RPBEPBE
basis: SDD
operation: Freq
keyword: #p
keyword: freq=noraman
keyword: PBEPBE/SDD
title: #p freq=noraman PBEPBE/SDD
converged: YES YES NO NO
title: Mulliken charges:
elementType: Cl O N C C C C C C C C C H H H H H H H H H H
charge: -0.055392 -0.267283 -0.115578 0.286137 0.102043 -0.348169 -0.349384 -0.602975 -0.607569 -0.202992 -0.202679 -0.100788 0.248607 0.249052 0.224219 0.224123 0.282905 0.260340 0.229242 0.229445 0.258348 0.258346
chargesum: 0.00000
title: Mulliken charges with hydrogens summed into heavy atoms:
elementType: Cl O N C C C C C C C C C
charge: -0.055392 -0.267283 -0.115578 0.286137 0.102043 -0.099562 -0.100332 0.128273 0.111458 0.055356 0.055667 -0.100788
polarizability: 1.68979335e+02 2.02524098e+00 7.96291658e+01 -1.80536175e-01 1.52400885e+00 9.69414095e+01
1716.lowfreq: -49.8911 -5.0874 -3.5209 -0.0009 0.0014 0.0029 4.4275 57.9528 78.8981
frequency: -49.8501 57.9515 78.8654 123.9328 134.8617 167.8765 178.2733 256.8075 257.4334 305.1777 320.5069 372.3605 398.7977 421.5904 466.8851 547.9127 615.6281 642.6590 709.9176 716.5080 733.7865 829.7193 831.6493 904.2207 948.2283 962.3164 999.7438 1049.6228 1059.6584 1071.9103 1093.1338 1105.6744 1145.3925 1184.9202 1215.6788 1245.3351 1292.4468 1354.8399 1385.8140 1387.2312 1410.1511 1439.5746 1469.1966 1470.5572 1474.3334 1486.7404 1504.8519 1572.1588 1578.0829 1594.5643 2963.8498 2971.9421 3032.8484 3047.3426 3117.2222 3122.3383 3143.2796 3144.3341 3172.8050 3175.8667
redmass: 4.4976 6.3349 2.9507 1.3686 1.0941 5.8333 2.8304 2.9647 9.3055 4.4958 4.1470 3.2025 2.8713 3.5795 7.2069 3.1956 7.1308 5.5976 4.7819 9.5824 4.1526 1.2682 1.6336 3.9405 1.3702 1.3757 4.4542 1.3944 2.6098 2.2420 1.2245 1.3722 1.3815 1.1302 3.2180 5.2349 1.2517 5.5751 3.5244 2.7297 1.1744 1.2057 1.0438 1.2265 1.7106 1.0456 1.3396 6.6390 7.6633 6.2352 1.0373 1.0357 1.1014 1.1017 1.0977 1.0955 1.0897 1.0897 1.0956 1.0967
irintensity: 1.7184 2.2906 0.0015 0.0008 0.1848 2.1990 1.5841 6.4800 0.5881 2.2223 9.9915 4.2288 0.0007 13.7439 21.0144 25.5689 0.4940 1.8779 6.9918 2.7497 7.2363 4.7611 71.8035 7.9018 0.7983 0.0049 61.5218 13.8669 73.0459 85.7092 0.0260 8.1051 0.3656 0.3572 34.4138 54.6055 0.2006 0.4801 5.7034 115.2986 51.6203 19.9807 1.6229 3.2107 42.8814 26.8154 9.2098 283.7778 1.1998 27.5882 43.5230 96.5375 36.0251 30.6074 1.2757 13.1105 4.7874 3.8251 5.7322 0.3833
temp: 298.150 k
press: 1.00000 atm
elementType: 17 8 7 6 6 6 6 6 6 6 6 6 1 1 1 1 1 1 1 1 1 1
symmnumber: 1
zpe: 445413.4 jmol-1
zpe.correction: 0.169649 hartree
zpe.thermalcorrener: 0.180998 hartree
zpe.thermalcorrenthalpy: 0.181942 hartree
zpe.thermalcorrgfe: 0.131762 hartree
zpe.sumelectzpe: -938.111446 hartree
zpe.sumelectthermal: -938.100097 hartree
zpe.sumelectthermalent: -938.099153 hartree
zpe.sumelectthermalfe: -938.149332 hartree
dipole: -2.0724 4.0298 -0.2299
dipole: 4.5373
quadrupole: -77.5888 -85.1956 -69.8354
quadrupole: -10.6340 0.5633 1.0047
quadrupole: -0.0489 -7.6557 7.7045 -10.6340 0.5633 1.0047
hfenergy: -938.2810948 hartree
pointgroup: C01 [X(C9H10Cl1N1O1)]
dipole: -0.802327 -1.5944489 0.0250229 debye
dipolederiv: -0.8947323 0.0716902 0.0004458 0.1070513 -0.0807566 -0.0016208 -0.0002722 -0.0015408 -0.1291904 -0.8291362 0.2090331 -0.0015876 -0.1578418 -1.147158 0.0118936 0.005196 0.0123859 -0.3334454 -0.843898 -0.3819724 0.0060953 -0.2963684 -0.907832 0.0092596 0.0043043 0.0086914 -0.3005074 -0.046155 0.0193338 -0.0004953 -0.0566573 -0.0700467 0.000349 0.0021964 0.0007388 -0.0187953 1.3842592 0.3184077 -0.0071298 0.6745187 1.5734236 -0.0231922 -0.0135718 -0.0219913 0.0973594 -0.0474877 -0.0200706 0.0372943 -0.0551181 -0.1300309 -0.0108009 -0.0410614 -0.0043664 0.0820504 -0.0464868 -0.022159 -0.0357755 -0.0484525 -0.1279431 0.0239091 0.0442428 0.0161758 0.0817155 0.4408591 0.0955526 -0.001666 -0.107935 -0.059091 0.0050892 0.0002889 0.0046299 0.2589554 -0.0154774 -0.0744541 0.0010359 0.0598545 0.4771967 -0.0031702 -0.0008369 -0.0025579 0.2790691 -0.3111601 0.0141541 -0.0779318 0.0088422 -0.1002577 0.0064779 -0.0587575 0.0115344 -0.002642 -0.3097536 0.0185091 0.0795563 0.0120466 -0.1009598 -0.0014813 0.0598037 -0.0064335 -0.0028791 1.2716633 -0.1379936 -0.0000876 -0.1653265 -0.0534357 0.0053962 0.001297 0.0052475 0.1206759 0.0369651 0.0152976 -0.0829484 0.0243263 0.1415161 0.004177 -0.0701864 -0.0033423 -0.0204433 0.0384961 0.0198313 0.0810635 0.0277043 0.1410909 -0.0141021 0.0675108 -0.0057496 -0.02028 -0.054067 -0.0442869 0.0355561 -0.0872593 0.0706332 0.1035649 0.124429 0.0906488 -0.0813183 -0.0537621 -0.0453169 -0.0337942 -0.0911515 0.0645303 -0.1083956 -0.1211305 -0.0952586 -0.0751601 0.1734422 -0.0046977 0.000078 0.1293156 -0.0006053 0.0022514 -0.0017575 0.0020102 0.1269242 -0.081853 0.0677209 -0.001678 0.071208 0.1030211 -0.0005898 -0.0023066 -0.0010229 0.0906241 0.0515009 -0.0694928 -0.0789633 -0.0437575 -0.0633944 -0.0487295 -0.0944559 -0.1387513 -0.0739218 0.0498258 -0.0685678 0.0820616 -0.0414926 -0.0581069 0.0488144 0.0963976 0.1380264 -0.0784108 0.0439501 0.0115433 0.0656415 0.0201123 0.1637416 -0.0129183 0.0636498 -0.010733 -0.0002675 0.0430074 0.0079382 -0.0667708 0.0163807 0.1644647 0.0038182 -0.0649795 0.0016586 -0.0001124 unknown
polarizability: 169.0066033|-1.3008563|79.5048008|-0.0074092|0.7964134|97.0385058 unknown
InChI: InChI=1S/C9H10ClNO/c1-11(2)9(12)7-3-5-8(10)6-4-7/h3-6H,1-2H3
charge 0 multiplicity 1
22 atoms
Cl 4.486597 -0.272209 -0.001881
O  -2.02716 1.76314 -0.020124
N  -2.473819 -0.528565 0.01281
C  -0.120134 0.271798 -0.000207
C  -1.609039 0.561018 -0.001869
C  0.588008 0.161321 -1.222631
C  0.596861 0.22902 1.221275
C  -3.927527 -0.289099 0.007809
C  -2.047898 -1.935856 0.033873
C  1.991267 -0.004357 -1.23189
C  2.000077 0.063275 1.229422
C  2.674045 -0.054059 -0.001387
H  0.047699 0.214634 -2.173964
H  0.063454 0.335578 2.171999
H  -4.395215 -0.720375 0.91347
H  -4.39377 -0.749432 -0.884186
H  -4.098143 0.7980 -0.00974
H  -0.950732 -2.007811 0.037548
H  -2.433336 -2.471186 -0.855858
H  -2.437665 -2.445405 0.936757
H  2.539244 -0.0872 -2.174603
H  2.554885 0.032171 2.171276
