program: Gaussian 09
title: 000084167
version: EM64L-G09RevD.01
frameworkgroup: C1[X(C8H8O2)]
method: RPBEPBE
basis: SDD
operation: Freq
keyword: #p
keyword: freq=noraman
keyword: PBEPBE/SDD
title: #p freq=noraman PBEPBE/SDD
converged: YES YES NO NO
title: Mulliken charges:
elementType: O O C C C C C C C C H H H H H H H H
charge: -0.269242 -0.269242 0.016858 0.199111 0.199111 -0.651442 -0.343816 -0.343816 -0.213130 -0.213129 0.228280 0.230866 0.230866 0.243953 0.249022 0.249023 0.228363 0.228362
chargesum: 0.00000
title: Mulliken charges with hydrogens summed into heavy atoms:
elementType: O O C C C C C C C C
charge: -0.269242 -0.269242 0.245138 0.199111 0.199111 0.054243 -0.094793 -0.094793 0.015233 0.015233
polarizability: 1.28481539e+02 1.36345251e-07 8.88086011e+01 4.48724658e+00 2.11915383e-06 4.70422314e+01
1716.lowfreq: -2.4863 0.0002 0.0005 0.0005 7.5618 7.8201 51.5305 185.7239 205.8988
frequency: 51.4543 185.7189 205.8979 257.1263 271.8447 414.8459 423.4318 433.0553 547.2739 549.6450 595.7155 655.5483 711.9651 744.0956 753.4445 773.2044 828.8092 835.9817 845.1568 915.4208 959.8273 1007.4654 1039.4259 1066.3421 1089.5650 1130.5960 1143.7665 1162.8845 1231.6375 1269.5401 1295.9261 1345.6845 1395.6321 1412.4392 1444.2747 1457.6415 1462.6549 1464.8397 1605.9417 1626.9851 2996.3585 3007.7184 3109.3438 3121.4078 3140.0886 3158.4462 3176.4830 3183.4115
redmass: 3.8620 2.4159 1.2766 5.7775 3.5711 3.0388 3.6372 4.0978 4.7231 4.1318 7.5193 6.8278 5.0834 1.2113 5.2236 4.5425 6.7372 3.5040 1.3457 1.3753 1.2850 2.0270 2.1562 2.0667 1.8571 1.7686 2.4256 1.1088 3.3464 1.4213 1.2970 1.4174 1.3410 4.0743 2.4486 1.0775 1.0462 3.3097 7.7823 7.9223 1.0862 1.0379 1.0996 1.1011 1.0860 1.0921 1.0950 1.0990
irintensity: 4.9599 0.0028 0.9140 0.7287 4.8095 6.0974 5.0515 0.2683 7.7734 0.1888 0.1313 4.6222 1.4198 114.9198 2.0857 21.3762 4.1920 63.9449 0.1169 6.7956 0.0001 16.0097 2.8916 100.6083 27.1905 0.0246 24.6838 20.2687 245.7002 2.4209 0.8676 39.3341 40.7592 25.0444 3.6984 14.0543 10.7798 171.0944 2.9127 2.7668 70.6136 12.6394 10.8949 23.1493 2.2369 18.9451 11.5900 4.7567
temp: 298.150 k
press: 1.00000 atm
elementType: 8 8 6 6 6 6 6 6 6 6 1 1 1 1 1 1 1 1
symmnumber: 1
zpe: 367887.4 jmol-1
zpe.correction: 0.140121 hartree
zpe.thermalcorrener: 0.148349 hartree
zpe.thermalcorrenthalpy: 0.149294 hartree
zpe.thermalcorrgfe: 0.106906 hartree
zpe.sumelectzpe: -459.352082 hartree
zpe.sumelectthermal: -459.343853 hartree
zpe.sumelectthermalent: -459.342909 hartree
zpe.sumelectthermalfe: -459.385296 hartree
dipole: -0.5606 0.0000 -0.2169
dipole: 0.6011
quadrupole: -47.1665 -58.1184 -60.3868
quadrupole: 0.0000 1.2016 0.0000
quadrupole: 8.0574 -2.8945 -5.1629 0.0000 1.2016 0.0000
hfenergy: -459.4922026 hartree
pointgroup: C01 [X(C8H8O2)]
dipole: -0.2232585 -0.0000002 -0.0779592 debye
dipolederiv: -1.4968382 0.0338931 -0.0311526 0.0822559 -0.4420683 0.0072467 -0.0199394 -0.0006669 -0.2723947 -1.4968424 -0.0338677 -0.0311516 -0.0822284 -0.4420665 -0.0072396 -0.0199354 0.0006739 -0.2723946 1.449611 -0.0000112 0.0132704 -0.0000116 0.536124 0.0000017 0.0711419 0.0000012 0.6557655 0.9730881 -0.1495278 0.0167295 -0.7300791 0.0529084 -0.0307443 0.0108008 -0.0081277 0.029691 0.9731091 0.1495047 0.0167242 0.7300559 0.0528892 0.0307432 0.0107718 0.0081266 0.0296893 -0.2372633 0.000006 0.1088783 0.0000063 0.0507038 -0.000004 0.1514148 -0.0000047 -0.0871536 -0.105625 0.0663271 0.0197845 -0.0324212 0.0802649 -0.0019824 0.0012757 0.0071379 -0.1663942 -0.1056249 -0.0663206 0.0197871 0.0324262 0.0802645 0.0019726 0.0012746 -0.0071475 -0.1663937 -0.0165895 -0.0275395 0.0030797 0.104115 -0.0061706 0.0149328 0.00782 -0.0084129 -0.1835959 -0.0165913 0.0275392 0.0030783 -0.1041148 -0.0061696 -0.0149394 0.0078238 0.0084063 -0.1835956 -0.0823111 0.0000012 -0.012193 -0.0000008 0.0316965 -0.0000036 -0.1404387 -0.0000023 -0.1885205 0.0202365 0.0740299 -0.0085014 0.1278853 -0.0264525 0.0343107 -0.0015563 0.0525778 0.0915853 0.0202309 -0.0740317 -0.0084995 -0.1278866 -0.0264505 -0.0343061 -0.0015526 -0.0525732 0.0915887 0.0786195 -0.0000011 -0.081489 -0.0000003 0.1094346 -0.0000024 -0.0429212 -0.0000029 -0.0753412 0.0998733 0.016696 -0.004387 0.0046033 -0.0609708 -0.000881 -0.0066484 0.0023653 0.1793481 0.099873 -0.0167002 -0.0043864 -0.0046078 -0.0609698 0.0008901 -0.0066482 -0.0023559 0.1793483 -0.0784797 -0.0878765 -0.0097842 -0.0880437 0.0385186 -0.004226 -0.01134 -0.0032039 0.169384 -0.0784757 0.0878792 -0.0097873 0.0880463 0.0385143 0.004231 -0.0113432 0.0032089 0.1693837 unknown
polarizability: 128.6898529|-0.0004626|88.8086011|1.7683563|-0.000803|46.833918 unknown
InChI: InChI=1S/C8H8O2/c1-6-9-7-4-2-3-5-8(7)10-6/h2-6H,1H3
charge 0 multiplicity 1
18 atoms
O  -1.203857 1.200103 -0.055043
O  -1.203887 -1.200061 -0.054997
C  -2.072289 0.000026 -0.287976
C  0.124562 0.706575 -0.025839
C  0.124545 -0.706565 -0.025813
C  -3.251284 0.000059 0.661809
C  1.307932 1.446216 0.035624
C  1.307896 -1.446234 0.035677
C  2.523926 0.707019 0.090967
C  2.523908 -0.707066 0.090993
H  -2.357061 0.000011 -1.359189
H  -3.870078 0.897208 0.489278
H  -3.870102 -0.89708 0.489312
H  -2.898423 0.000074 1.705701
H  1.296375 2.539269 0.041915
H  1.296311 -2.539286 0.042009
H  3.474179 1.249302 0.132914
H  3.474148 -1.249371 0.13296
