program: Gaussian 09
title: 000084166
version: EM64L-G09RevD.01
frameworkgroup: C1[X(C7H14O4)]
method: RPBEPBE
basis: SDD
operation: Freq
keyword: #pfreq=noraman
keyword: PBEPBE/SDD
title: #p freq=noraman PBEPBE/SDD
converged: YES YES NO NO
title: Mulliken charges:
elementType: O O O O C C C C C C C H H H H H H H H H H H H H H
charge: -0.256799 -0.243516 -0.254777 -0.262017 0.032273 -0.226203 -0.232675 -0.674174 -0.679420 0.319072 -0.747131 0.253742 0.203815 0.241621 0.226506 0.223478 0.207623 0.234084 0.225051 0.207210 0.229890 0.227395 0.250304 0.249415 0.245231
chargesum: 0.00000
title: Mulliken charges with hydrogens summed into heavy atoms:
elementType: O O O O C C C C C C C
charge: -0.256799 -0.243516 -0.254777 -0.262017 0.286015 0.219234 0.217309 -0.007416 -0.014925 0.319072 -0.002180
polarizability: 1.05489828e+02 -1.60372998e+00 9.71160627e+01 1.79501284e+00 -4.65581071e+00 7.35623717e+01
1716.lowfreq: -11.9109 -8.9602 0.0003 0.0004 0.0010 7.9402 35.3728 46.4018 55.6980
frequency: 35.2241 46.3217 55.6810 70.6217 76.9144 86.5798 93.1746 138.6965 208.9825 233.1751 239.2945 259.1940 300.4696 327.0374 346.1315 473.6032 495.8982 565.5109 623.2491 642.1222 783.5138 804.5194 811.5252 821.2965 863.4768 903.1170 976.2099 992.8254 1018.2508 1038.5939 1042.3407 1094.6813 1113.8416 1129.7461 1137.7937 1140.0738 1210.3192 1247.3687 1261.9626 1290.0692 1322.6018 1358.7052 1381.5879 1386.4261 1397.5170 1401.1899 1451.6195 1454.6243 1459.4796 1461.5506 1479.8787 1482.5321 1489.9342 1494.2185 1642.0523 2973.7539 2993.7377 2995.4806 3004.0205 3006.9865 3043.9942 3058.0741 3064.4970 3091.4340 3092.4674 3097.3645 3104.9098 3105.3320 3141.9507
redmass: 2.5421 2.5198 1.2428 2.2814 4.1883 2.3018 2.8273 4.3082 4.9565 1.3512 1.1744 2.3208 3.2930 4.1886 4.4485 4.1177 4.3109 3.3003 5.8249 5.1261 3.7250 5.0771 1.0989 1.1031 4.1643 4.7479 3.2107 2.4367 2.1496 3.2645 1.6847 3.6907 2.2538 1.9960 1.4433 1.8055 2.9659 1.1603 1.1480 1.2991 1.1545 1.2996 1.2490 1.2316 1.2660 1.3166 1.0634 1.0491 1.0403 1.0404 1.0509 1.0476 1.0843 1.0861 9.1164 1.0580 1.0357 1.0362 1.0568 1.0370 1.1055 1.0881 1.1067 1.0986 1.0987 1.0965 1.1023 1.1020 1.1014
irintensity: 0.1832 0.1864 2.3459 1.5657 0.8418 3.4222 4.6847 2.1601 8.0841 1.1193 0.5897 1.9373 1.7738 9.7306 7.0619 2.0397 11.7891 2.7563 4.0839 5.2397 138.4247 267.8603 3.1021 0.9042 118.9441 2.8972 148.2670 169.0481 23.2780 153.2616 18.6848 248.3376 19.1053 60.5375 6.0668 64.6687 174.7916 1.2715 4.4281 2.0765 22.7642 2.3904 51.0220 17.0476 19.7526 11.0492 30.9469 19.0274 11.2816 10.8211 4.4094 4.4550 9.8154 6.1443 210.6635 48.9570 26.0967 20.6182 23.9692 2.5196 9.6594 18.7591 9.1231 30.9714 35.7049 7.9612 21.0997 60.9666 11.0029
temp: 298.150 k
press: 1.00000 atm
elementType: 8 8 8 8 6 6 6 6 6 6 6 1 1 1 1 1 1 1 1 1 1 1 1 1 1
symmnumber: 1
zpe: 540935.3 jmol-1
zpe.correction: 0.206031 hartree
zpe.thermalcorrener: 0.220147 hartree
zpe.thermalcorrenthalpy: 0.221091 hartree
zpe.thermalcorrgfe: 0.163264 hartree
zpe.sumelectzpe: -575.116878 hartree
zpe.sumelectthermal: -575.102763 hartree
zpe.sumelectthermalent: -575.101819 hartree
zpe.sumelectthermalfe: -575.159646 hartree
dipole: 0.6273 0.0267 1.1806
dipole: 1.3372
quadrupole: -66.9479 -57.7031 -66.7208
quadrupole: 2.3079 -0.4102 -3.5406
quadrupole: -3.1573 6.0876 -2.9302 2.3079 -0.4102 -3.5406
hfenergy: -575.3229095 hartree
pointgroup: C01 [X(C7H14O4)]
dipole: -0.114413 -0.1737617 -0.483203 debye
dipolederiv: -1.2266438 0.43593 0.1104016 0.5129098 -0.8664475 -0.1043364 -0.102125 0.1562028 -0.3557684 -0.6007757 -0.0886284 -0.0182138 -0.0337562 -1.3971353 -0.2733372 -0.0092469 -0.3866252 -0.5393144 -1.1431911 -0.6663502 0.0694054 -0.6510639 -1.4616458 -0.0990719 0.2371777 0.1398517 -0.346157 -0.5985343 0.1446537 0.2345161 -0.1447827 -0.8265542 -0.1821944 0.1233866 -0.3463725 -0.5664977 1.8208877 0.2830653 -0.0231786 -0.0160492 1.8858826 0.1443705 0.0504053 -0.5435385 0.4625111 0.6790633 -0.270531 -0.1641151 -0.2946059 0.4968029 0.0647454 -0.2794091 0.1164517 0.3229715 0.3905649 0.0820836 0.0172493 0.0315067 0.5879867 0.2248357 0.0176499 0.4715068 0.4920294 -0.0628503 0.0828713 -0.0420946 0.0808299 0.0047188 0.0488063 -0.0471928 0.0532147 0.0091714 0.0597397 -0.0212652 0.0009291 -0.0161834 -0.1369372 -0.0152608 0.0008073 -0.0244528 0.0590983 0.973287 0.2379948 -0.4106482 0.693828 1.6413667 0.2651832 -0.3048448 0.4508111 0.6364656 -0.2712164 -0.1067592 0.1786569 -0.0802106 -0.0514147 0.0186803 0.2649078 0.0474386 -0.1477273 -0.0365543 -0.0389556 0.0058688 -0.0002275 -0.0427076 -0.0888846 -0.0130214 0.0014124 -0.0702323 -0.0627416 -0.0020885 0.0871064 -0.0311928 -0.0561187 0.1262964 0.1263718 0.0570774 -0.072682 0.0187455 -0.0354878 -0.0877231 0.004242 -0.029233 -0.0684936 -0.0098392 -0.0875281 -0.0058564 -0.0608323 0.0387381 -0.1028412 0.0593581 0.019011 0.0367086 -0.0642794 -0.0355656 -0.0187443 -0.0623508 -0.0444406 0.1144433 -0.0567114 0.0196101 0.019761 0.0665682 -0.0468267 -0.0458895 -0.0281693 0.1108468 0.0710038 0.1179577 0.021407 -0.0654369 0.0889816 -0.0803686 0.0166359 0.0465897 -0.0870419 0.0765317 -0.0595712 0.0177281 0.0921557 0.0323325 0.1067254 -0.0086099 0.0330887 -0.0686049 -0.0672277 -0.1079607 -0.0163761 -0.0929019 -0.1010071 -0.051146 0.0226147 0.1089396 -0.0165756 -0.0196093 -0.0124127 -0.0031937 -0.0911485 -0.0217566 -0.1301935 -0.1077467 -0.0647645 0.0893679 -0.0914322 0.049785 0.0475238 0.0311621 -0.0891231 0.0844359 0.0566489 -0.0643248 -0.0597571 0.1084559 -0.0244252 0.0656798 0.0172899 0.1147414 0.0759566 0.0338758 0.0768367 -0.0009783 -0.0656134 -0.0247975 0.1249379 0.0086549 -0.0361294 0.0144094 -0.0525191 0.0236234 0.0683611 0.0079643 0.1031984 0.0017973 0.0299317 -0.0283149 0.0241621 0.1307648 0.0515831 -0.0664481 0.0101646 -0.0996647 -0.0466889 -0.0475157 -0.0170404 -0.0670388 0.0949575 unknown
polarizability: 96.0260086|1.7585411|104.4450321|-5.7671556|6.836067|75.6972215 unknown
InChI: InChI=1S/C7H14O4/c1-4-9-7(10-5-2)11-6(3)8/h7H,4-5H2,1-3H3
charge 0 multiplicity 1
25 atoms
O  -1.236624 0.216014 -0.14068
O  -0.172513 -1.804117 0.528582
O  1.120697 0.034821 -0.149318
O  0.936298 2.11584 0.892117
C  -0.149843 -0.398376 0.559019
C  -2.145779 1.026485 0.718321
C  -0.313701 -2.420931 -0.824533
C  -3.136906 1.717044 -0.213979
C  -0.432638 -3.925815 -0.602397
C  1.535205 1.346756 0.104062
C  2.774227 1.678659 -0.697538
H  -0.086121 -0.089616 1.617033
H  -2.665843 0.353117 1.429224
H  -1.533628 1.75944 1.277432
H  -1.211016 -1.998171 -1.311745
H  0.579789 -2.159675 -1.420903
H  -3.847919 2.32531 0.374442
H  -2.60719 2.381269 -0.91772
H  -3.710448 0.975669 -0.796839
H  -0.528806 -4.444629 -1.57375
H  0.460405 -4.316054 -0.084706
H  -1.319872 -4.162104 0.009914
H  2.513093 1.751203 -1.768588
H  3.526866 0.879297 -0.59521
H  3.189168 2.639063 -0.359236
