program: Gaussian 09
title: 000084149
version: EM64L-G09RevD.01
frameworkgroup: C1[X(C6H6N4O3)]
method: RPBEPBE
basis: SDD
operation: Freq
keyword: #pfreq=noraman
keyword: PBEPBE/SDD
title: #p freq=noraman PBEPBE/SDD
converged: NO YES NO NO
title: Mulliken charges:
elementType: O O O N N N N C C C C C C H H H H H H
charge: -0.344063 -0.260172 -0.313781 -0.208532 -0.117885 -0.371556 -0.042784 0.121575 0.102596 0.163143 0.278298 -0.593294 -0.199211 0.344393 0.271778 0.255058 0.254058 0.273904 0.386475
chargesum: 0.00000
title: Mulliken charges with hydrogens summed into heavy atoms:
elementType: O O O N N N N C C C C C C
charge: 0.042413 -0.260172 -0.313781 -0.208532 -0.117885 -0.027163 -0.042784 0.121575 0.102596 0.163143 0.278298 0.187600 0.074693
polarizability: 1.40167987e+02 -1.42145616e+00 1.24424365e+02 -1.07150161e-01 -7.50756173e-02 4.49658674e+01
1716.lowfreq: -10.4958 -3.4526 -0.0008 -0.0006 0.0004 1.1399 84.0312 96.5740 124.8129
frequency: 83.9961 96.5546 124.8122 141.0328 184.3179 261.9862 293.2443 293.8371 313.4012 334.2582 368.5981 431.1659 465.2850 480.4045 526.8014 599.1108 640.8126 651.8535 675.7269 683.3434 735.6980 784.9626 817.5630 902.5334 937.7218 984.7780 1041.7480 1090.3898 1112.2624 1129.4094 1206.4585 1224.9424 1243.6417 1296.1278 1338.4856 1362.0732 1390.6335 1424.8009 1442.2958 1471.7874 1476.0982 1507.3099 1587.8032 1595.5534 1651.2782 3013.4899 3108.8705 3139.1532 3226.8602 3252.0778 3585.5450
redmass: 1.1107 4.1038 7.0005 6.7207 9.3399 6.2591 5.2693 3.9449 8.4522 4.7000 10.4036 9.6845 1.1221 9.3026 8.1883 4.2468 9.2502 3.6614 4.9792 1.4950 10.2510 5.4819 1.4342 8.3087 7.6594 3.5236 3.7722 1.9271 3.2573 1.3063 4.1932 2.3543 3.6218 4.9025 3.2899 2.5660 3.3360 1.2974 2.3631 1.0615 1.0796 5.0270 5.5231 5.8375 11.0945 1.0325 1.1025 1.1027 1.0641 1.0995 1.0828
irintensity: 0.5907 5.4479 0.0351 0.4565 6.9573 20.2433 0.6566 3.4571 5.8450 28.8856 16.4740 5.3063 125.1301 14.4930 1.2954 15.0187 1.3018 39.9883 9.0253 120.2273 5.3098 2.5267 18.0484 6.8184 9.5521 7.6805 139.5644 0.8641 6.8066 0.2151 1.2800 18.2147 18.7343 62.7144 59.7989 126.0154 7.7171 110.2414 107.4470 13.5085 7.9776 156.7392 232.6206 224.8916 384.9837 21.3923 14.3216 0.5602 67.3060 2.1296 97.5649
temp: 298.150 k
press: 1.00000 atm
elementType: 8 8 8 7 7 7 7 6 6 6 6 6 6 1 1 1 1 1 1
symmnumber: 1
zpe: 345319.4 jmol-1
zpe.correction: 0.131525 hartree
zpe.thermalcorrener: 0.142518 hartree
zpe.thermalcorrenthalpy: 0.143462 hartree
zpe.thermalcorrgfe: 0.094815 hartree
zpe.sumelectzpe: -675.949661 hartree
zpe.sumelectthermal: -675.938669 hartree
zpe.sumelectthermalent: -675.937725 hartree
zpe.sumelectthermalfe: -675.986372 hartree
dipole: 1.9224 -2.3681 -0.0054
dipole: 3.0501
quadrupole: -63.2700 -85.2419 -74.4441
quadrupole: -8.3812 0.0243 -0.0158
quadrupole: 11.0487 -10.9232 -0.1255 -8.3812 0.0243 -0.0158
hfenergy: -676.0811867 hartree
pointgroup: C01 [X(C6H6N4O3)]
dipole: 0.7048742 0.9678736 0.0800422 debye
dipolederiv: -0.1704136 -0.0309762 -0.0023801 -0.0380883 -0.6236175 -0.023003 -0.0022992 -0.0242183 -0.3159091 -0.5617425 0.1286733 0.0079758 0.143484 -1.3751436 -0.0768134 0.0106035 -0.0729503 -0.3642909 -1.0773601 -0.414155 -0.0369127 -0.4849524 -0.8324956 -0.0376472 -0.0423002 -0.0377417 -0.3842293 -0.7384969 -0.2636885 -0.0260113 -0.2345643 -1.0663711 -0.0656 -0.016265 -0.0692897 -0.2009038 -1.0470468 -0.45599 -0.0425909 0.0932158 0.233117 0.022599 -0.0012459 0.0206655 -0.0590157 -0.1634288 -0.1228223 -0.009103 -0.1497303 -0.6114346 -0.0315983 -0.0106467 -0.0305029 -0.2047312 -0.6274056 -0.2651885 -0.0228735 -0.0880477 -0.3559929 -0.009536 -0.0093449 -0.0103315 -0.2402913 -0.3851839 0.693116 0.0496433 0.3611645 -0.3856829 -0.0226526 0.0241282 -0.0217368 -0.0485295 0.9213539 0.4989038 0.0435787 0.1713966 0.4697818 0.0271166 0.0191442 0.0281445 0.1334725 1.1965181 -0.1530843 -0.0041206 0.0181355 1.72636 0.1112128 0.0085564 0.1077012 0.260327 1.5661474 0.5058689 0.0499205 0.2184962 1.0807797 0.0627025 0.0271687 0.0661289 0.2732593 0.3629046 -0.1196794 -0.0023306 -0.1845095 0.0912018 -0.0124165 -0.0099399 -0.0131902 0.1951114 0.0609796 0.0514366 0.0044154 0.1242521 0.6476667 0.0529894 0.0102115 0.0522758 -0.0447147 0.243281 0.0667748 0.0043133 0.0437693 0.2518214 -0.0078244 0.0023979 -0.0078802 0.3601065 0.1682012 -0.0666912 -0.0092149 0.068745 -0.0039206 -0.0173598 0.0025567 -0.014781 0.1287062 0.001876 0.0149857 0.0474739 -0.0454102 0.0912556 0.0908613 0.0704005 0.045295 -0.0126143 -0.0002963 0.0273817 -0.0432377 -0.0191838 0.1112822 -0.0609202 -0.0813253 -0.0149449 -0.050084 0.0368493 -0.0385059 -0.0038961 -0.0362701 0.1035935 -0.0067295 -0.0038945 -0.0068142 0.1903177 0.2132632 -0.0563597 -0.0046495 0.0380976 0.4477991 0.0046194 0.0020939 0.0041706 0.3840132 unknown
polarizability: 139.9621602|2.1959996|124.1835717|0.9691254|5.903764|45.4124884 unknown
InChI: InChI=1S/C6H6N4O3/c1-9-5(11)3-4(8-2-7-3)10(13)6(9)12/h2,7,13H,1H3
charge 0 multiplicity 1
19 atoms
O  0.016511 -2.790695 -0.263443
O  -0.528145 2.749691 0.149162
O  -2.364998 -1.621926 -0.193712
N  -1.469932 0.572163 -0.018986
N  -0.074512 -1.369127 -0.155376
N  2.208172 1.300574 0.059844
N  2.398807 -0.968645 -0.108093
C  0.902045 0.802478 0.014764
C  1.062465 -0.594925 -0.089551
C  -0.358657 1.495728 0.058721
C  -1.370444 -0.826946 -0.125105
C  -2.844881 1.124479 0.010257
C  3.062124 0.213601 -0.015818
H  2.450284 2.288749 0.136051
H  -2.753473 2.213055 0.138811
H  -3.411045 0.679838 0.84423
H  -3.366981 0.892724 -0.932594
H  4.145177 0.303867 -0.001904
H  -0.967017 -3.040985 -0.287357
