program: Gaussian 09
title: 000084154
version: EM64L-G09RevD.01
frameworkgroup: C1[X(C10H14O4)]
method: RPBEPBE
basis: SDD
operation: Freq
keyword: #pfreq=noraman
keyword: PBEPBE/SDD
title: #p freq=noraman PBEPBE/SDD
converged: YES YES NO NO
title: Mulliken charges:
elementType: O O O O C C C C C C C C C C H H H H H H H H H H H H H H
charge: -0.323640 -0.442552 -0.461580 -0.255619 -0.030976 -0.332556 -0.349523 0.236593 0.199063 -0.339251 -0.332970 -0.229391 -0.240835 -0.540041 0.240377 0.187334 0.244449 0.206485 0.217951 0.254932 0.241963 0.230223 0.226409 0.351055 0.352321 0.225741 0.218198 0.245839
chargesum: 0.00000
title: Mulliken charges with hydrogens summed into heavy atoms:
elementType: O O O O C C C C C C C C C C
charge: -0.323640 -0.091497 -0.109258 -0.255619 0.209402 0.099227 0.074914 0.236593 0.199063 -0.084319 -0.091007 0.000832 -0.014426 0.149737
polarizability: 1.47518157e+02 -2.21842916e+00 1.36450302e+02 6.79194720e+00 -1.12256866e+01 8.23418409e+01
1716.lowfreq: -6.3151 -0.0011 -0.0010 -0.0007 3.2300 10.7542 19.8129 28.5080 67.0339
frequency: 19.6549 28.2524 67.0231 97.5712 100.9669 113.8842 169.8187 177.2969 200.5563 236.9835 242.2657 253.6317 299.4611 330.4881 373.8899 426.5656 453.7437 479.1510 492.9869 513.7876 541.2084 568.4470 596.0179 709.4997 744.7709 753.5579 779.3054 840.5520 858.6190 906.5321 925.2805 966.3734 968.0184 981.0619 983.5892 1020.1171 1038.0087 1054.4267 1100.9804 1107.7189 1111.7131 1148.1353 1168.2323 1173.2145 1187.3294 1212.2822 1217.1119 1237.7577 1263.2865 1301.1721 1317.6790 1342.0889 1378.4721 1385.2544 1407.0879 1425.9192 1442.0221 1461.8861 1467.2806 1469.6505 1471.9036 1485.9974 1589.3819 1599.0472 2959.4173 2964.0487 2966.2322 3012.7944 3033.6171 3047.8298 3111.7297 3125.5953 3132.1431 3140.4470 3156.8363 3170.8991 3530.0580 3583.4601
redmass: 5.0674 5.0942 5.0052 3.1971 4.1929 3.2312 3.3505 2.8900 2.8008 1.1650 1.4269 3.0210 3.5471 4.1880 3.0978 4.4540 1.6848 2.4784 2.6875 5.0657 4.2307 4.3144 5.2745 3.9898 3.1521 1.4577 3.4125 1.5780 3.0008 1.9281 1.3802 3.1590 1.4401 3.9319 8.1736 3.2011 2.0357 1.9851 2.2705 1.7513 1.2632 1.4825 1.1285 1.1485 1.9607 1.3189 1.2572 3.3782 1.5069 1.2291 1.2787 1.2334 7.1337 1.4567 1.4401 1.6373 1.4668 1.0812 1.0511 1.1958 1.0858 2.0177 6.8694 6.7322 1.0332 1.0651 1.0597 1.0917 1.1010 1.1038 1.0942 1.0993 1.0854 1.0901 1.0935 1.1004 1.0650 1.0669
irintensity: 0.9012 2.5205 1.9372 4.4611 3.1257 10.1447 3.1309 4.7263 7.3816 150.0303 0.1552 2.6924 0.7436 18.3888 7.2487 5.9947 87.5327 69.0811 74.4788 7.9329 1.7132 4.4523 1.8042 3.1097 22.8825 79.1706 22.8311 4.9229 27.9565 11.1118 2.6170 104.8661 16.7954 78.2224 60.4723 41.1493 15.3200 28.4797 89.0123 8.1445 0.5544 11.7055 13.4903 11.9668 62.9801 13.3225 25.5550 171.9031 8.5222 7.4418 3.5222 22.5838 7.0615 13.3597 1.4110 15.0901 19.3350 4.7546 12.1461 61.8108 33.3020 78.4087 10.8729 24.4750 69.6600 33.7481 51.7939 10.4088 66.6023 47.0960 12.2630 21.4287 0.5043 10.4744 20.5499 16.6320 6.8663 4.0237
temp: 298.150 k
press: 1.00000 atm
elementType: 8 8 8 8 6 6 6 6 6 6 6 6 6 6 1 1 1 1 1 1 1 1 1 1 1 1 1 1
symmnumber: 1
zpe: 590483.2 jmol-1
zpe.correction: 0.224903 hartree
zpe.thermalcorrener: 0.239834 hartree
zpe.thermalcorrenthalpy: 0.240778 hartree
zpe.thermalcorrgfe: 0.181353 hartree
zpe.sumelectzpe: -689.219472 hartree
zpe.sumelectthermal: -689.204542 hartree
zpe.sumelectthermalent: -689.203598 hartree
zpe.sumelectthermalfe: -689.263023 hartree
dipole: 4.0811 3.6706 1.3103
dipole: 5.6432
quadrupole: -83.1658 -71.6623 -84.9911
quadrupole: -4.9583 -1.8004 -0.3579
quadrupole: -3.2261 8.2774 -5.0513 -4.9583 -1.8004 -0.3579
hfenergy: -689.4443756 hartree
pointgroup: C01 [X(C10H14O4)]
dipole: 1.620115 1.3901764 0.6099359 debye
polarizability: 147.1712621|-2.548545|137.4556756|7.6981601|-8.8735035|81.6833628 unknown
InChI: InChI=1S/C10H14O4/c1-13-9-4-2-3-5-10(9)14-8(6-11)7-12/h2-5,8,11-12H,6-7H2,1H3
charge 0 multiplicity 1
28 atoms
O  -0.774901 -0.092334 -0.782873
O  -3.117273 -1.541127 -1.322603
O  -3.023354 1.449988 1.75035
O  1.275548 1.706613 -0.588321
C  -1.92633 0.026691 0.162696
C  -3.171276 -0.219102 -0.695489
C  -1.888939 1.416419 0.810425
C  0.453028 -0.519838 -0.225795
C  1.547065 0.395167 -0.173343
C  0.625543 -1.852017 0.202216
C  2.806149 -0.057484 0.29341
C  1.880022 -2.295678 0.68085
C  2.966784 -1.396439 0.719213
C  2.40181 2.644039 -0.623252
H  -1.843317 -0.757667 0.940192
H  -3.254962 0.583919 -1.458936
H  -4.068869 -0.209967 -0.059017
H  -1.983237 2.19545 0.026181
H  -0.921894 1.554914 1.334667
H  -0.22742 -2.537647 0.139759
H  3.660561 0.624755 0.334888
H  2.005652 -3.332964 1.007175
H  3.945618 -1.731144 1.079464
H  -2.258844 -1.579896 -1.82074
H  -3.027426 2.313213 2.232955
H  3.199687 2.287666 -1.3031
H  2.823093 2.811161 0.387633
H  1.978081 3.583011 -1.008404
