program: Gaussian 09
title: 000084143
version: EM64L-G09RevD.01
frameworkgroup: C1[X(C9H9ClO)]
method: RPBEPBE
basis: SDD
operation: Freq
keyword: #p
keyword: freq=noraman
keyword: PBEPBE/SDD
title: #p freq=noraman PBEPBE/SDD
converged: YES YES NO NO
title: Mulliken charges:
elementType: Cl O C C C C C C C C C H H H H H H H H H
charge: -0.072432 -0.421507 0.384954 -0.632708 0.116235 -0.390648 -0.333087 -0.106546 -0.211541 -0.079354 -0.576608 0.239246 0.233874 0.256221 0.255516 0.256487 0.254235 0.363007 0.230132 0.234525
chargesum: 0.00000
title: Mulliken charges with hydrogens summed into heavy atoms:
elementType: Cl O C C C C C C C C C
charge: -0.072432 -0.058500 0.384954 -0.159588 0.116235 -0.134427 -0.077571 -0.106546 0.044946 0.174881 -0.111952
polarizability: 1.68193605e+02 -4.48545333e+00 1.02432263e+02 4.91917283e+00 2.51158471e+00 5.66052724e+01
1716.lowfreq: -15.3451 -4.6734 0.0018 0.0020 0.0024 4.1301 54.1970 96.7776 120.2540
frequency: 54.1683 96.7651 120.2434 147.6759 198.3003 255.0843 294.4866 340.8474 358.2406 364.0599 454.3277 457.6442 532.8133 542.5719 570.5409 629.8889 662.9867 721.4180 758.2440 821.2391 856.7745 884.3862 913.1626 936.2047 945.5452 962.0337 1020.6122 1077.9015 1091.3949 1116.4022 1171.9180 1182.5347 1205.7259 1256.2790 1286.0029 1300.9025 1304.9016 1388.1595 1415.0473 1425.0205 1447.4423 1474.2357 1579.6924 1617.9325 1640.4382 2973.2768 3030.4053 3086.0933 3100.6969 3149.3377 3160.2972 3180.1373 3199.7702 3423.0137
redmass: 3.2039 3.2554 5.2608 3.5105 4.8475 3.8111 4.9742 5.7945 3.9303 4.9073 3.0495 2.6919 1.1866 3.4959 1.8502 7.1231 2.4635 3.9698 3.8208 1.4544 2.3240 1.9021 1.5375 2.4490 1.3422 1.3485 1.1263 2.0276 1.9223 1.6479 1.4399 2.5331 1.3702 1.5081 1.2658 1.8501 1.2804 5.0715 3.2473 1.2348 1.1679 2.5254 7.0012 6.8029 4.5187 1.0602 1.0993 1.0604 1.0938 1.0925 1.0886 1.0977 1.1141 1.0663
irintensity: 0.8045 0.7823 0.8547 1.5855 0.7399 0.9592 2.4616 0.9101 2.5269 0.8232 7.6472 13.4620 88.0660 0.0222 26.6169 32.3306 14.5116 3.3961 10.3223 39.7886 22.0417 14.1169 12.7486 23.4747 0.2593 70.0047 33.6491 7.4246 8.4152 2.2397 90.0071 75.3137 25.8659 8.3827 0.6656 10.4434 4.8789 17.0416 3.0845 6.7894 28.1330 144.6976 0.7970 0.3754 15.4775 20.0879 8.6743 8.5649 8.3344 2.7552 1.9182 3.8808 18.2820 284.2476
temp: 298.150 k
press: 1.00000 atm
elementType: 17 8 6 6 6 6 6 6 6 6 6 1 1 1 1 1 1 1 1 1
symmnumber: 1
zpe: 401856.9 jmol-1
zpe.correction: 0.153059 hartree
zpe.thermalcorrener: 0.163534 hartree
zpe.thermalcorrenthalpy: 0.164478 hartree
zpe.thermalcorrgfe: 0.116451 hartree
zpe.sumelectzpe: -882.816410 hartree
zpe.sumelectthermal: -882.805936 hartree
zpe.sumelectthermalent: -882.804992 hartree
zpe.sumelectthermalfe: -882.853019 hartree
dipole: -3.0514 -1.1995 0.1351
dipole: 3.2815
quadrupole: -69.2500 -71.5327 -72.7486
quadrupole: 6.9644 -0.1278 1.4878
quadrupole: 1.9271 -0.3555 -1.5715 6.9644 -0.1278 1.4878
hfenergy: -882.9694696 hartree
pointgroup: C01 [X(C9H9Cl1O1)]
dipole: -1.2540452 0.3054996 -0.0285909 debye
dipolederiv: -0.6813252 -0.2823547 -0.0750309 -0.3443735 -0.3128822 -0.0687483 -0.0848103 -0.0641433 -0.0956596 -1.2286802 -0.4195725 -0.1257734 -0.4146313 -0.5263971 -0.064013 -0.0847718 -0.0008471 -0.4069537 0.0845865 -0.0516746 -0.0567755 -0.2926063 -0.0810947 0.0118797 -0.2272657 0.0203569 -0.0936957 -0.0800066 -0.0141597 -0.0581901 -0.1668393 0.1519721 -0.0350481 -0.0711676 -0.0166168 0.0636626 0.9226197 0.503239 0.1432835 0.6191795 0.2691033 0.0841191 0.1729622 0.0502357 0.0846298 -0.1259462 -0.1090016 -0.0377886 -0.0297327 -0.0632292 0.0247182 -0.0087199 0.0307935 -0.0950927 -0.1681783 -0.1577985 -0.0614147 0.0592376 0.0408994 0.0663865 0.0109637 0.0610435 -0.1435377 0.8108257 0.4874979 0.1226708 0.5792749 0.2898599 0.106006 0.1595444 0.0958278 -0.0537162 -0.1556708 -0.0436213 -0.0178358 -0.1542202 -0.0084552 0.0420598 -0.0546035 0.0416799 -0.0969959 0.087792 0.1404636 0.0731101 0.3159315 -0.1360037 -0.0899793 0.3046925 -0.090254 0.1473181 -0.221786 0.1041281 0.0025493 0.0982335 -0.39016 -0.1106994 -0.0361644 -0.0998663 0.0723613 -0.064397 0.00685 0.1008513 -0.0027959 0.0492858 0.0955761 0.045678 0.039845 -0.0484055 0.0391567 -0.0774328 -0.0449722 0.0119212 -0.0801244 -0.0543626 -0.0724855 -0.034827 0.073968 0.1048372 0.0283427 0.0148021 0.0133671 -0.0275081 -0.066734 0.0000706 -0.0666858 0.1307523 0.0763587 -0.0149345 -0.0000644 0.0044915 -0.0296171 -0.0708387 0.0033339 -0.0729392 0.1412668 -0.0246625 0.0576417 0.0296507 0.0487861 0.0881928 -0.0305099 0.0281743 -0.0277976 0.1561852 0.0765179 -0.0558431 0.0444254 -0.0653758 0.1104825 0.0667896 -0.0201185 0.06621 -0.0721223 0.4417386 -0.0403326 0.0283998 -0.1738829 0.3245931 -0.0066778 0.004057 -0.0422999 0.3118222 -0.0008329 -0.0234526 -0.0927897 -0.0522506 0.1786278 0.0289057 -0.1119974 0.0253173 -0.0085877 0.1070525 -0.0379846 0.0108923 -0.0537142 0.1524549 0.0711705 0.0426279 0.0849674 -0.0671993 unknown
polarizability: 165.6434649|13.5355442|100.576313|3.2946634|14.5429588|61.0113628 unknown
InChI: InChI=1S/C9H9ClO/c1-2-3-7-6-8(10)4-5-9(7)11/h2,4-6,11H,1,3H2
charge 0 multiplicity 1
20 atoms
Cl 3.710826 1.42399 0.46898
O  -1.288124 -1.833034 -0.385547
C  -0.255255 0.312915 0.311662
C  -1.60655 0.923469 0.678745
C  -0.161258 -1.023149 -0.18088
C  0.942157 1.045178 0.496529
C  1.095896 -1.608135 -0.453876
C  2.185301 0.45027 0.215452
C  2.282829 -0.873891 -0.253562
C  -2.643312 0.848866 -0.434465
C  -3.903289 0.3567 -0.292939
H  -2.015046 0.432531 1.585281
H  -1.4490 1.98783 0.939909
H  0.898933 2.074043 0.868597
H  1.126906 -2.637271 -0.822749
H  3.25778 -1.322582 -0.463489
H  -2.322866 1.24403 -1.410214
H  -2.119683 -1.284084 -0.4175
H  -4.612751 0.352679 -1.127386
H  -4.264193 -0.036158 0.666751
