program: Gaussian 09
title: 000084164
version: EM64L-G09RevD.01
frameworkgroup: C1[X(C12H24)]
method: RPBEPBE
basis: SDD
operation: Freq
keyword: #p
keyword: freq=noraman
keyword: PBEPBE/SDD
title: #p freq=noraman PBEPBE/SDD
converged: YES YES NO NO
title: Mulliken charges:
elementType: C C C C C C C C C C C C H H H H H H H H H H H H H H H H H H H H H H H H
charge: 0.370152 -0.434538 0.289939 -0.596135 -0.777553 -0.750718 -0.727153 -0.730585 -0.725715 0.543087 -0.843588 -0.735548 0.215347 0.178674 0.216730 0.192257 0.218796 0.204033 0.234037 0.206272 0.209826 0.215029 0.208065 0.211477 0.212707 0.234939 0.205343 0.204626 0.203741 0.204755 0.214918 0.224479 0.243483 0.224166 0.218558 0.216098
chargesum: 0.00000
title: Mulliken charges with hydrogens summed into heavy atoms:
elementType: C C C C C C C C C C C C
charge: 0.370152 -0.040517 0.289939 -0.187148 -0.120687 -0.119591 -0.094904 -0.085677 -0.102302 0.543087 -0.151460 -0.300891
polarizability: 1.40968454e+02 1.77066408e-02 1.34451745e+02 3.85134202e+00 -2.85467347e+00 1.12093880e+02
1716.lowfreq: -11.1128 -0.0005 -0.0003 0.0003 5.4121 13.5335 36.9638 55.9539 92.4045
frequency: 36.8867 55.8870 92.4015 115.1587 175.8007 180.9695 196.0575 209.9525 237.0358 252.8446 262.3794 271.4181 287.9765 297.3132 302.9173 321.2619 361.9393 369.7360 383.6502 407.5282 415.1880 433.2665 456.9622 503.0339 576.1148 684.9175 719.7000 773.1418 822.1069 857.2256 876.1381 882.2738 915.1406 924.5551 926.6502 930.3381 938.4095 949.5477 976.5510 986.9689 999.1592 1014.0389 1026.4292 1030.8265 1051.4864 1115.4407 1153.0960 1165.3027 1214.3009 1219.6307 1248.7642 1265.5129 1285.7998 1313.9614 1338.2939 1344.7678 1369.3865 1374.0285 1374.9434 1391.5502 1393.9459 1400.4766 1425.8308 1453.2337 1456.0923 1459.3447 1463.1163 1464.5872 1466.0311 1472.2017 1472.8480 1479.3378 1480.3592 1490.2277 1492.2607 1495.7718 1501.8391 1661.8068 2944.4466 2960.4889 2961.8574 2967.3565 2967.7873 2968.4147 2973.6610 2976.0351 3008.9424 3024.3027 3046.5274 3052.9989 3055.1833 3056.3201 3062.1277 3062.7788 3065.4976 3074.5842 3077.8520 3083.4156 3086.4681 3095.8734 3097.5773 3188.1714
redmass: 2.8135 2.8152 3.0042 2.2658 1.1586 2.3659 1.7878 1.4483 1.3384 1.5451 1.8985 1.2689 1.1237 1.8269 1.3042 2.3411 2.2915 2.3663 2.2208 1.9496 1.8004 2.1007 2.0488 2.5205 2.2464 1.3090 3.2478 2.6115 2.9280 1.8423 1.9938 2.0844 1.7310 1.6313 1.3377 1.4168 1.2159 1.6057 1.8346 1.7784 1.3232 1.4179 1.4161 1.4438 1.5054 1.6961 1.5538 1.8783 2.6498 2.4312 3.1672 2.8670 1.5776 1.8330 1.4649 1.3117 1.2039 1.2037 1.2134 1.2113 1.2143 1.2082 1.1868 1.0702 1.0568 1.0538 1.0483 1.0677 1.0606 1.0534 1.0610 1.0651 1.0594 1.0555 1.0583 1.0571 1.0570 4.7485 1.0610 1.0573 1.0347 1.0358 1.0386 1.0372 1.0377 1.0391 1.0981 1.1010 1.0937 1.0997 1.0994 1.0987 1.0995 1.0984 1.0984 1.0995 1.0987 1.0988 1.0632 1.0958 1.0954 1.1139
irintensity: 0.1050 0.0105 0.1728 0.0190 0.0772 0.2643 0.1093 0.1063 0.2475 0.1112 0.0756 0.1772 0.2509 0.1586 0.0933 0.0504 1.4287 1.7215 1.7469 0.8001 0.1864 1.0211 2.5771 1.0611 4.2292 0.2965 0.0865 1.5948 3.6446 2.7990 0.2145 1.5660 2.4117 3.8751 70.0927 1.4408 0.1821 3.6413 6.9965 2.0131 0.1583 2.1595 0.6319 0.9385 3.2154 1.1274 4.1666 9.1207 11.0372 11.0448 27.3978 16.0130 0.9143 8.3894 3.0549 11.5714 10.1738 40.4810 6.1140 18.8766 26.7797 12.2136 0.9931 0.5765 2.8225 2.3171 1.8063 0.5120 10.0126 0.7697 13.8283 8.3000 14.8366 9.0644 22.9035 24.6624 10.6845 23.6335 32.7411 25.1582 34.7201 30.7762 33.0433 43.9088 54.8987 15.3401 13.3482 29.1813 20.2301 2.6475 32.5599 33.2505 44.5781 76.1603 88.5345 51.8431 27.5705 41.9784 5.6214 22.8711 47.0816 30.1475
temp: 298.150 k
press: 1.00000 atm
elementType: 6 6 6 6 6 6 6 6 6 6 6 6 1 1 1 1 1 1 1 1 1 1 1 1 1 1 1 1 1 1 1 1 1 1 1 1
symmnumber: 1
zpe: 861622.6 jmol-1
zpe.correction: 0.328175 hartree
zpe.thermalcorrener: 0.343971 hartree
zpe.thermalcorrenthalpy: 0.344915 hartree
zpe.thermalcorrgfe: 0.286941 hartree
zpe.sumelectzpe: -470.641432 hartree
zpe.sumelectthermal: -470.625635 hartree
zpe.sumelectthermalent: -470.624691 hartree
zpe.sumelectthermalfe: -470.682666 hartree
dipole: 0.0113 -0.4790 0.1503
dipole: 0.5021
quadrupole: -79.1051 -79.4574 -79.9045
quadrupole: -1.4276 1.6171 0.1834
quadrupole: 0.3839 0.0316 -0.4155 -1.4276 1.6171 0.1834
hfenergy: -470.9696065 hartree
pointgroup: C01 [X(C12H24)]
dipole: -0.0023189 0.1839686 0.0719651 debye
polarizability: 140.943604|0.2295528|133.9485013|-3.9067742|4.4010616|112.6219739 unknown
InChI: InChI=1S/C12H24/c1-10(2)8-12(6,7)9-11(3,4)5/h1,8-9H2,2-7H3
charge 0 multiplicity 1
36 atoms
C  -0.29059 0.878212 -0.064365
C  0.615724 -0.397477 -0.182263
C  2.162704 -0.415402 0.102948
C  -1.657876 0.560062 -0.800817
C  -0.579389 1.249498 1.416586
C  0.300919 2.119565 -0.785837
C  2.556528 -1.918805 0.226647
C  2.979346 0.180085 -1.079634
C  2.576984 0.293111 1.419582
C  -2.551311 -0.535686 -0.217339
C  -3.647722 -0.09383 0.740476
C  -2.42549 -1.841969 -0.580079
H  0.152244 -1.165047 0.4700
H  0.502464 -0.784413 -1.218439
H  -1.40739 0.304234 -1.849536
H  -2.236351 1.506875 -0.831386
H  -0.939651 0.372623 1.984936
H  -1.353473 2.039326 1.472626
H  0.321024 1.632336 1.923822
H  -0.421795 2.95809 -0.758451
H  1.229286 2.467597 -0.300456
H  0.527966 1.902429 -1.846357
H  3.651625 -2.02968 0.341374
H  2.249513 -2.485321 -0.673285
H  2.070681 -2.386368 1.103827
H  2.794479 1.257632 -1.220064
H  2.729723 -0.334337 -2.027496
H  4.063609 0.046752 -0.899564
H  2.439968 1.387837 1.36265
H  3.648126 0.104045 1.627047
H  1.994944 -0.083449 2.280959
H  -4.34818 0.598102 0.231393
H  -3.238083 0.455728 1.607691
H  -4.230571 -0.952115 1.117789
H  -1.670093 -2.170087 -1.30342
H  -3.079592 -2.619052 -0.166266
