program: Gaussian 09
title: 000084121
version: EM64L-G09RevD.01
frameworkgroup: C1[X(C9H9N)]
method: RPBEPBE
basis: SDD
operation: Freq
keyword: #p
keyword: freq=noraman
keyword: PBEPBE/SDD
title: #p freq=noraman PBEPBE/SDD
converged: YES YES NO NO
title: Mulliken charges:
elementType: N C C C C C C C C C H H H H H H H H H
charge: -0.054570 0.445203 -0.443006 0.158916 -0.305519 -0.378378 -0.177749 -0.162612 -0.556215 -0.547386 0.228842 0.223083 0.237067 0.214896 0.216141 0.220810 0.215069 0.212807 0.252602
chargesum: 0.00000
title: Mulliken charges with hydrogens summed into heavy atoms:
elementType: N C C C C C C C C C
charge: -0.054570 0.445203 -0.214164 0.158916 -0.082436 -0.141311 0.037147 0.053529 -0.120337 -0.081977
polarizability: 1.92901921e+02 -2.21539292e+00 1.01024306e+02 1.36729266e-03 1.65627257e-02 4.14740510e+01
1716.lowfreq: -6.1304 -5.0914 0.0002 0.0004 0.0009 4.7509 56.4994 102.8817 168.6377
frequency: 56.4885 102.8786 168.6376 199.9832 216.1075 258.3486 368.4888 424.2401 472.2431 483.7126 568.9790 598.8665 631.2463 738.0783 743.6869 773.2754 853.5177 884.8874 918.3536 945.9720 961.1286 966.8763 972.8124 998.9612 1008.9576 1027.7388 1030.6059 1117.3335 1178.4117 1264.2637 1286.2492 1300.3349 1307.3282 1326.5812 1362.0827 1415.8472 1442.3028 1459.2576 1545.6002 1581.8258 1641.5399 1649.5460 3094.1194 3097.5988 3106.9344 3113.4760 3123.9491 3127.2213 3160.7440 3208.0518 3220.0588
redmass: 2.7204 2.7514 3.3777 2.7684 2.2520 3.1433 4.0416 2.4523 5.8573 2.0313 3.0964 3.2598 1.7565 1.8939 4.4702 2.6011 1.4853 3.9515 1.6299 1.3387 5.3543 1.4095 1.4247 1.0922 1.1632 1.6573 1.5350 1.4684 1.4185 2.7014 2.1933 1.5578 1.7855 1.9201 1.9371 1.2947 1.3505 2.3976 6.6824 5.0749 4.8017 4.5223 1.0759 1.0662 1.0767 1.0853 1.0894 1.0911 1.0957 1.1142 1.1159
irintensity: 0.0060 1.4046 0.4706 1.8121 0.7571 1.8662 0.0068 16.3922 5.1157 1.2818 2.1934 1.9359 5.6428 2.9549 1.3597 0.0006 28.4666 9.1170 22.5888 85.0653 3.7807 0.7665 43.2150 36.4857 32.7714 7.3748 9.3078 1.9290 1.2300 6.6985 6.4206 0.9411 4.1010 0.4290 17.1088 23.5922 0.3359 22.0749 44.5424 110.7315 1.1264 3.7512 16.2777 6.3940 5.7847 16.3784 32.1236 4.5208 16.7460 20.1789 12.4730
temp: 298.150 k
press: 1.00000 atm
elementType: 7 6 6 6 6 6 6 6 6 6 1 1 1 1 1 1 1 1 1
symmnumber: 1
zpe: 397792.6 jmol-1
zpe.correction: 0.151511 hartree
zpe.thermalcorrener: 0.160570 hartree
zpe.thermalcorrenthalpy: 0.161514 hartree
zpe.thermalcorrgfe: 0.117123 hartree
zpe.sumelectzpe: -402.357593 hartree
zpe.sumelectthermal: -402.348534 hartree
zpe.sumelectthermalent: -402.347590 hartree
zpe.sumelectthermalfe: -402.391981 hartree
dipole: -2.0656 -1.2220 -0.0007
dipole: 2.4000
quadrupole: -52.7827 -52.0376 -64.9128
quadrupole: -3.8493 0.0132 0.0112
quadrupole: 3.7950 4.5401 -8.3351 -3.8493 0.0132 0.0112
hfenergy: -402.5091046 hartree
pointgroup: C01 [X(C9H9N1)]
dipole: 0.8161439 -0.474543 0.0171546 debye
dipolederiv: -0.4962929 -0.0303579 0.0044256 -0.1169861 -0.4325375 0.0112048 0.00888 0.0104759 -0.246591 0.5601601 -0.0407545 -0.0028218 -0.0108837 0.1276129 -0.0020071 -0.005128 -0.0018907 0.0809787 -0.686341 -0.1066268 0.0107769 0.0625014 0.0475297 -0.0117164 0.0023696 -0.0099008 -0.1694558 0.8463065 0.2419927 -0.0202957 0.1372632 0.1150284 -0.0019767 -0.0146033 -0.0030122 0.1041677 -0.2094127 0.2059036 -0.0098666 0.0368403 -0.2734791 0.0070769 -0.0010174 0.0057585 -0.1341738 0.1124571 -0.1502204 0.0060105 0.0344169 0.4301188 -0.026896 -0.0035379 -0.0256982 -0.058498 0.0442349 0.0252448 -0.0035748 -0.1895036 0.2209653 -0.0183713 0.0077793 -0.0207342 -0.1516303 -0.1681771 -0.0946647 0.0049372 0.1769909 0.1917048 -0.0224774 -0.0104612 -0.0198285 -0.1890839 -0.2103062 -0.0112173 -0.0008803 0.0178249 0.0716905 -0.0242781 -0.0004087 -0.0240281 -0.3769638 -0.1309267 0.0463966 -0.0044971 -0.0588786 0.0338677 -0.0203819 0.0012659 -0.0213697 -0.3501824 0.0940498 0.0139269 -0.0001411 -0.0001696 -0.1056395 0.0137017 0.0007563 0.0134732 0.1569827 -0.0430329 -0.1115493 0.0077453 -0.0692136 0.0437299 0.0064296 0.0053865 0.0069501 0.1528792 0.0705226 0.0034812 0.0003915 -0.0151072 -0.1387281 0.0145426 0.0014586 0.0147036 0.1275056 0.0417677 -0.0624959 0.0046479 0.0494228 -0.1210277 0.0144619 -0.0014061 0.0156938 0.1528483 0.0445561 0.0699194 -0.0025869 -0.0387722 -0.1243134 0.0162159 0.0032823 0.0151024 0.1662786 -0.05517 0.0805335 -0.0019859 0.1020614 0.027307 0.0074888 -0.0039403 0.0078556 0.1856379 0.1172147 0.0075073 0.0002404 -0.0237078 -0.1080058 0.0158336 0.0013729 0.0153676 0.1843154 -0.071467 -0.0904628 0.0072375 -0.1154616 0.0302129 0.0091002 0.0085942 0.0088537 0.1772357 0.1398571 0.0034436 0.0002372 0.0213624 -0.0360368 0.0120492 -0.0006428 0.0122281 0.1877493 unknown
polarizability: 192.8490431|2.8050314|100.890566|-1.6761769|-3.1896838|41.6606683 unknown
InChI: InChI=1S/C9H9N/c1-3-8-5-6-10-9(4-2)7-8/h3-7H,1-2H2
charge 0 multiplicity 1
19 atoms
N  -1.291692 1.130808 -0.073537
C  1.2505 -0.201714 -0.027735
C  0.028077 -0.92255 0.021913
C  -1.218345 -0.242214 -0.001271
C  1.158056 1.215852 -0.102058
C  -0.117708 1.819599 -0.121649
C  2.530162 -0.941729 -0.002527
C  -2.481874 -1.00901 0.052298
C  3.780753 -0.406796 -0.045028
C  -3.720663 -0.448118 0.033354
H  0.041476 -2.017927 0.078363
H  2.053787 1.842955 -0.143925
H  -0.211093 2.910631 -0.180361
H  2.433666 -2.03571 0.058302
H  -2.373023 -2.101048 0.110533
H  4.669204 -1.045799 -0.019164
H  3.959237 0.673145 -0.10396
H  -4.627712 -1.060122 0.074926
H  -3.826507 0.640448 -0.024876
