program: Gaussian 09
title: 000084581
version: EM64L-G09RevD.01
frameworkgroup: C1[X(C12H16Cl2NO6P)]
method: RPBEPBE
basis: SDD
operation: Freq
keyword: #p
keyword: freq=noraman
keyword: PBEPBE/SDD
title: #p freq=noraman PBEPBE/SDD
converged: YES YES NO NO
title: Mulliken charges:
elementType: Cl Cl P O O O O O O N C C C C C C C C C C C C H H H H H H H H H H H H H H H H
charge: -0.075592 -0.079329 1.404612 -0.540825 -0.512073 -0.539723 -0.583500 -0.211230 -0.211801 0.022384 -0.228134 -0.223264 -0.362177 -0.366904 0.361009 -0.566169 -0.566238 -0.297965 -0.332717 0.384210 -0.340712 -0.331794 0.240188 0.254434 0.240407 0.246734 0.230769 0.238457 0.235044 0.236026 0.273151 0.280786 0.274063 0.291496 0.306624 0.269298 0.289091 0.291366
chargesum: 0.00000
title: Mulliken charges with hydrogens summed into heavy atoms:
elementType: Cl Cl P O O O O O O N C C C C C C C C C C C C
charge: -0.075592 -0.079329 1.404612 -0.540825 -0.512073 -0.539723 -0.583500 -0.211230 -0.211801 0.022384 0.266488 0.263877 0.107049 0.104166 0.361009 -0.012232 -0.000680 0.008659 -0.063419 0.384210 -0.051622 -0.040429
polarizability: 2.70890607e+02 -2.06741053e+01 1.56946783e+02 1.75346600e+01 7.82303805e+00 1.93582588e+02
1716.lowfreq: -8.0542 -5.3339 -0.0019 -0.0013 0.0018 3.8702 6.6537 10.8361 11.2853
frequency: 5.7558 10.3019 11.2199 11.6447 25.5669 30.9937 48.8500 58.0887 70.1378 72.5777 101.7277 120.6472 128.1184 151.3341 168.7671 191.7370 194.6090 207.3756 237.0193 245.6100 274.8526 308.7496 314.9484 321.3504 362.1160 379.4382 408.7149 414.8700 427.2027 472.5745 481.6903 493.3050 506.1042 553.5012 598.2464 602.4608 624.2706 649.2962 664.2840 684.8559 712.8672 732.7174 777.2433 797.8381 810.1900 833.0675 836.0231 867.2706 881.4699 883.7010 906.9453 912.0556 980.4413 992.0097 993.0424 998.5336 1000.9171 1033.8391 1036.8636 1065.7256 1093.4653 1107.9906 1108.8659 1108.9563 1145.9042 1147.5838 1164.4961 1183.6933 1188.5709 1197.3688 1223.1860 1262.4021 1266.7808 1292.1563 1297.3628 1297.8903 1358.0591 1359.1797 1363.7170 1370.1600 1372.1751 1399.9267 1425.5049 1430.7917 1431.3964 1446.4838 1452.3456 1471.4762 1471.9295 1473.1533 1592.1651 1602.8291 2995.4088 2995.5260 3009.3227 3017.0655 3056.9746 3057.6073 3071.0159 3073.2647 3087.4129 3094.2210 3153.4553 3156.5340 3162.3315 3175.1432 3185.8759 3193.4376
redmass: 11.0054 6.9262 11.3468 5.3131 8.2105 6.8228 5.5646 8.6916 7.0724 7.0199 6.9980 5.1795 6.9471 3.4401 3.5972 3.2362 8.6122 4.1870 5.8520 5.9776 7.0117 5.1027 3.3318 3.3768 3.9005 6.6200 3.8305 3.0010 4.5052 4.3000 3.5548 3.5289 7.2394 7.5571 4.3016 4.2268 7.4091 6.9096 4.6598 7.1669 4.4117 4.9109 8.1523 1.6875 1.6808 1.7494 2.8468 1.5959 2.9413 3.1653 3.6256 3.1005 1.3426 1.7572 1.3759 2.0716 2.5855 1.6092 1.5840 13.2507 3.1714 1.4974 1.7870 1.8059 1.2830 1.2933 1.6654 1.1027 1.1169 2.6102 6.3663 1.1829 1.1754 1.2782 1.1775 1.1726 1.2816 6.6988 1.3129 1.5511 1.5326 10.8277 3.9109 1.0858 1.0873 1.0969 1.0960 1.2997 1.5656 1.1545 7.5262 6.8541 1.0610 1.0609 1.0580 1.0581 1.0947 1.0927 1.0636 1.0611 1.1090 1.1095 1.1114 1.1115 1.0915 1.0891 1.0955 1.0977
irintensity: 0.6527 0.5856 0.5628 1.0325 0.4666 2.1704 2.4382 1.8422 0.0497 0.5474 0.8392 4.5534 0.5102 15.9140 0.6137 6.8504 2.5495 6.2113 11.8886 13.5335 3.5604 3.6728 12.0275 9.5811 17.3310 38.9829 2.9777 0.1809 16.3045 21.4349 19.2863 31.8727 9.6415 12.1346 57.6119 3.3001 15.0731 17.1315 21.2318 224.1540 95.3733 7.5800 10.9468 26.5653 5.7188 101.4113 203.0654 46.5521 35.1084 122.3927 284.1535 160.0653 1.8006 42.5723 0.4192 63.3119 11.4471 9.1097 3.0575 134.3282 15.6277 16.4029 13.5516 4.6921 2.6553 5.2076 332.9171 1.0788 7.2099 131.4540 342.0800 3.2464 6.0744 0.5555 7.7461 24.5423 6.4838 81.8945 8.7941 3.4926 1.9504 19.5317 32.2771 18.6051 18.4960 16.3796 10.6752 46.2289 93.2132 1.3274 73.1577 129.3519 10.2398 12.8978 20.9583 19.9260 9.4786 7.2357 24.5425 22.2610 12.4722 16.7159 13.7633 9.4691 2.5039 0.6183 1.1764 3.3274
temp: 298.150 k
press: 1.00000 atm
elementType: 17 17 15 8 8 8 8 8 8 7 6 6 6 6 6 6 6 6 6 6 6 6 1 1 1 1 1 1 1 1 1 1 1 1 1 1 1 1
symmnumber: 1
zpe: 725416.9 jmol-1
zpe.correction: 0.276297 hartree
zpe.thermalcorrener: 0.300593 hartree
zpe.thermalcorrenthalpy: 0.301537 hartree
zpe.thermalcorrgfe: 0.212929 hartree
zpe.sumelectzpe: -2232.541839 hartree
zpe.sumelectthermal: -2232.517543 hartree
zpe.sumelectthermalent: -2232.516599 hartree
zpe.sumelectthermalfe: -2232.605206 hartree
dipole: -8.5235 2.5537 -1.0659
dipole: 8.9614
quadrupole: -175.9768 -137.2461 -165.2219
quadrupole: 6.1598 2.9006 0.6086
quadrupole: -16.4952 22.2355 -5.7403 6.1598 2.9006 0.6086
hfenergy: -2232.8181358 hartree
pointgroup: C01 [X(C12H16Cl2N1O6P1)]
dipole: 3.3666107 1.0122737 -0.2678258 debye
polarizability: 273.4176932|22.4754607|154.6111641|2.0118489|0.1368034|193.391121 unknown
InChI: InChI=1S/C12H16Cl2NO6P/c13-7-1-9-19-22(18,20-10-2-8-14)21-12-5-3-11(4-6-12)15(16)17/h3-6H,1-2,7-10H2
charge 0 multiplicity 1
38 atoms
Cl 4.498661 -2.517435 -2.371239
Cl -0.752708 3.065097 -2.418603
P  1.630785 0.442955 1.092088
O  3.101222 -0.157713 0.456813
O  1.671129 2.064105 0.567984
O  0.530065 -0.370514 -0.016946
O  1.329615 0.262588 2.633667
O  -5.57783 -1.318392 1.650961
O  -5.729459 -1.342692 -0.625805
N  -5.055856 -1.230642 0.471733
C  3.428585 -1.610971 0.633637
C  2.06897 2.402349 -0.840394
C  4.916287 -1.750785 0.316505
C  1.606109 3.840408 -1.067386
C  -0.86058 -0.537757 0.183587
C  5.287406 -1.34159 -1.109041
C  0.089702 4.02167 -1.008718
C  -1.45243 -0.650932 1.466517
C  -1.628252 -0.643059 -1.000755
C  -3.600098 -0.987934 0.371385
C  -2.839034 -0.874437 1.555662
C  -3.010398 -0.876146 -0.908724
H  3.214173 -1.908833 1.676464
H  2.804996 -2.190755 -0.069361
H  3.165439 2.308306 -0.916674
H  1.576751 1.703833 -1.541024
H  5.49338 -1.114422 1.016483
H  5.216475 -2.799889 0.49857
H  2.056938 4.488411 -0.289485
H  1.993967 4.182068 -2.045806
H  6.369097 -1.412018 -1.292237
H  4.907035 -0.342914 -1.364788
H  -0.21168 5.067761 -1.160584
H  -0.343223 3.617113 -0.08333
H  -0.840453 -0.563556 2.369145
H  -1.13142 -0.53695 -1.968317
H  -3.33682 -0.967845 2.524269
H  -3.636548 -0.962679 -1.800052
