program: Gaussian 09
title: 000084114
version: EM64L-G09RevD.01
frameworkgroup: C1[X(C4H7N3O)]
method: RPBEPBE
basis: SDD
operation: Freq
keyword: #pfreq=noraman
keyword: PBEPBE/SDD
title: #p freq=noraman PBEPBE/SDD
converged: YES YES NO NO
title: Mulliken charges:
elementType: O N N N C C C C H H H H H H H
charge: -0.225119 -0.643539 -0.102115 -0.084461 -0.264070 -0.665925 0.336923 -0.200758 0.218881 0.220074 0.211362 0.244910 0.244769 0.359292 0.349774
chargesum: 0.00000
title: Mulliken charges with hydrogens summed into heavy atoms:
elementType: O N N N C C C C
charge: -0.225119 0.065528 -0.102115 -0.084461 0.174885 0.035117 0.336923 -0.200758
polarizability: 9.66432644e+01 1.78379645e+01 7.84009708e+01 2.94938764e-02 -3.96258529e-02 3.87535023e+01
1716.lowfreq: -4.5479 -0.0002 0.0006 0.0006 6.1108 12.7449 59.9481 89.0407 90.5513
frequency: 59.9468 88.9577 90.5359 162.7886 216.0803 234.5910 351.6186 358.6759 439.8789 475.5083 513.9422 564.2775 612.8146 660.7553 764.1884 833.2263 889.4635 966.7418 1026.0447 1115.4902 1126.6166 1209.2202 1266.3503 1322.5976 1390.0884 1405.4763 1458.2911 1475.8110 1486.1527 1604.7427 1690.6445 2164.1887 2962.7911 3004.6733 3027.9985 3102.0953 3120.0103 3565.2298 3715.0033
redmass: 3.4941 2.1685 5.6983 6.7786 4.0184 1.1519 3.2299 1.1841 7.2189 3.3376 4.1831 1.3383 7.9280 8.6986 4.5243 1.0887 3.6265 2.4267 2.9699 2.2832 1.3996 3.1386 1.1550 1.8616 1.9372 1.3182 1.0382 1.0654 1.0718 1.2455 6.8627 12.6048 1.0544 1.0367 1.1091 1.0987 1.1020 1.0455 1.1047
irintensity: 0.6992 0.3785 1.4508 0.0301 0.8760 0.0198 0.4948 98.6541 1.8170 1.8364 75.6978 117.0138 14.0634 51.6081 3.4207 3.6679 9.1880 79.2313 130.9748 1.5803 6.2336 66.8778 0.0803 183.9480 121.4865 1.6672 13.4146 10.6706 3.3127 106.1569 801.4167 255.9894 41.0672 14.5829 30.8523 21.3071 23.9445 91.5044 50.3298
temp: 298.150 k
press: 1.00000 atm
elementType: 8 7 7 7 6 6 6 6 1 1 1 1 1 1 1
symmnumber: 1
zpe: 302197.7 jmol-1
zpe.correction: 0.115101 hartree
zpe.thermalcorrener: 0.124239 hartree
zpe.thermalcorrenthalpy: 0.125183 hartree
zpe.thermalcorrgfe: 0.080542 hartree
zpe.sumelectzpe: -395.454466 hartree
zpe.sumelectthermal: -395.445328 hartree
zpe.sumelectthermalent: -395.444384 hartree
zpe.sumelectthermalfe: -395.489025 hartree
dipole: 8.2739 5.2347 0.0014
dipole: 9.7907
quadrupole: -55.3582 -43.7641 -47.6650
quadrupole: -6.8872 0.0139 0.0199
quadrupole: -6.4291 5.1650 1.2641 -6.8872 0.0139 0.0199
hfenergy: -395.5695671 hartree
pointgroup: C01 [X(C4H7N3O1)]
dipole: 3.3637285 1.7058653 0.7829828 debye
dipolederiv: -1.4667888 0.334911 -0.1075275 0.8645326 -0.6270001 0.053792 -0.0124678 -0.0201248 -0.2667339 -0.6702975 -0.3761828 -0.061249 -0.5271105 -1.1676079 -0.1559694 -0.0893686 -0.1346843 -0.757957 -1.5923178 -0.5439438 -0.2891538 -0.4356151 -0.904381 -0.1819213 -0.270678 -0.197662 -0.3144207 -0.5202941 -0.1828612 -0.0631032 -0.234889 -0.4485539 -0.0586921 -0.0724965 -0.0513226 -0.3265114 0.9339576 -0.1702604 0.0417131 -0.0542441 0.2684586 -0.034319 0.063075 -0.0507154 0.4117487 -0.0530897 0.0733246 0.0011614 0.0580554 -0.0668348 -0.0119543 -0.0012041 -0.0099306 0.0337989 2.465655 0.367481 0.3658787 -0.2747515 1.619833 0.1947144 0.2515642 0.2846036 0.4363273 0.6442599 0.52475 0.1757689 0.6872131 0.682505 0.2076456 0.2059178 0.1852643 0.1305484 -0.0853479 0.0005899 0.010532 -0.0828766 -0.0686626 0.1010029 0.0349321 0.1151536 -0.0234828 -0.0688865 0.0354335 -0.005335 -0.0341622 0.0136397 -0.099529 -0.058809 -0.0927174 -0.1218857 -0.1576184 0.0136013 -0.0360679 0.0067099 0.0763588 -0.0075743 -0.0374064 -0.0066881 0.1157 0.0913324 -0.0726362 0.0731406 -0.020605 0.0033373 0.0741413 0.0627179 0.0843715 0.0047642 0.12193 -0.0256456 -0.0507682 0.0144163 0.0590648 -0.0467247 -0.0229017 -0.0696177 -0.0815246 0.1704042 -0.0145523 -0.036384 0.0468462 0.2914708 -0.0151091 -0.025488 -0.0239611 0.4009232 0.1871015 0.0359911 -0.018606 -0.0135196 0.2683725 -0.0195031 -0.0273871 -0.0119689 0.3587053 unknown
polarizability: 97.9977548|14.4534057|73.9683619|10.9291636|8.4675684|41.8316207 unknown
InChI: InChI=1S/C4H7N3O/c1-2-8-4(6)7-3-5/h2,6H2,1H3
charge 0 multiplicity 1
15 atoms
O  0.663572 -0.292365 -0.012461
N  0.416235 2.047323 0.380001
N  -1.44622 0.755115 -0.120314
N  -2.908061 -1.2377 -0.685613
C  2.134498 -0.184497 0.21261
C  2.700918 -1.587642 0.022703
C  -0.151193 0.829077 0.0766
C  -2.150048 -0.340745 -0.417164
H  2.563033 0.523458 -0.525661
H  2.315999 0.185448 1.242097
H  3.795273 -1.575051 0.175622
H  2.252265 -2.288479 0.745608
H  2.491657 -1.955596 -0.995071
H  -0.213202 2.844587 0.437891
H  1.409575 2.173867 0.54385
