program: Gaussian 09
title: 000084131
version: EM64L-G09RevD.01
frameworkgroup: C1[X(C8H8N2O4)]
method: RPBEPBE
basis: SDD
operation: Freq
keyword: #pfreq=noraman
keyword: PBEPBE/SDD
title: #p freq=noraman PBEPBE/SDD
converged: YES YES NO NO
title: Mulliken charges:
elementType: O O O O N N C C C C C C C C H H H H H H H H
charge: -0.189142 -0.189087 -0.182662 -0.182614 0.006780 0.006695 0.312882 -0.485977 0.239217 0.239432 -0.678366 -0.351594 -0.351537 -0.207442 0.234756 0.234720 0.243066 0.225978 0.243132 0.288043 0.288011 0.255708
chargesum: 0.00000
title: Mulliken charges with hydrogens summed into heavy atoms:
elementType: O O O O N N C C C C C C C C
charge: -0.189142 -0.189087 -0.182662 -0.182614 0.006780 0.006695 0.312882 -0.016501 0.239217 0.239432 0.033810 -0.063551 -0.063526 0.048266
polarizability: 1.52215626e+02 2.61245661e-03 1.44673770e+02 2.92473605e-03 -8.60955478e-01 6.16331443e+01
1716.lowfreq: -3.6994 -0.0003 0.0005 0.0006 9.3071 11.5659 38.2739 58.5484 71.3760
frequency: 38.2672 58.5482 71.3756 160.3750 171.4724 173.0675 185.8543 190.7924 287.5370 288.1405 324.1781 375.1685 390.2488 454.3774 474.9338 522.2209 576.7764 600.9140 657.1852 670.4175 721.0933 732.4849 744.3815 786.8107 791.1750 827.0836 844.7173 947.8975 971.3267 993.9468 1055.9017 1067.7988 1090.5591 1102.3320 1168.6500 1199.2178 1203.0452 1209.4558 1215.7448 1272.7054 1299.2356 1362.5544 1369.9040 1383.8002 1387.4838 1433.0458 1446.4445 1477.3646 1480.4620 1491.3115 1573.4448 1600.7143 3004.4265 3031.4456 3086.3853 3102.2321 3125.7854 3166.4529 3182.9219 3193.3772
redmass: 13.1058 11.4936 5.2061 2.6754 4.6248 2.4677 1.3969 11.5761 5.4416 6.7833 8.3935 3.6193 6.0675 4.1079 6.1611 4.9804 3.7826 4.8141 9.7642 9.2005 8.6387 4.1086 3.7061 1.2944 4.0328 1.9655 4.8503 1.3974 2.6731 1.3675 2.0239 1.5960 2.0305 8.2645 1.3923 2.7470 2.0071 3.5772 9.1542 1.2705 1.3222 2.9335 7.7152 5.2811 1.5459 2.3893 3.2870 1.0430 1.0816 1.1234 6.5406 7.3041 1.0353 1.0592 1.1018 1.0981 1.1029 1.0883 1.0924 1.0998
irintensity: 0.7310 3.0481 3.3521 1.0775 0.1799 0.0079 0.3410 6.4719 1.5325 0.1336 0.6126 0.0858 1.1147 0.0682 0.4859 5.4775 3.5105 0.1406 9.4988 33.2916 0.1940 21.8562 11.1256 17.3368 14.5109 30.2976 15.2307 2.6936 1.2479 3.3653 19.6297 11.9484 11.2581 0.0817 12.9832 23.2486 94.0269 247.4796 22.2627 6.4924 0.0706 177.5942 19.5848 0.1440 26.9214 1.0011 82.9617 12.7402 8.6215 20.8632 26.7179 8.8148 31.2535 12.0216 4.8511 25.4924 14.3168 3.3428 3.0847 1.4104
temp: 298.150 k
press: 1.00000 atm
elementType: 8 8 8 8 7 7 6 6 6 6 6 6 6 6 1 1 1 1 1 1 1 1
symmnumber: 1
zpe: 411616.9 jmol-1
zpe.correction: 0.156777 hartree
zpe.thermalcorrener: 0.169298 hartree
zpe.thermalcorrenthalpy: 0.170242 hartree
zpe.thermalcorrgfe: 0.117092 hartree
zpe.sumelectzpe: -718.848875 hartree
zpe.sumelectthermal: -718.836355 hartree
zpe.sumelectthermalent: -718.835410 hartree
zpe.sumelectthermalfe: -718.888560 hartree
dipole: -0.0019 -2.8763 1.0578
dipole: 3.0647
quadrupole: -106.2492 -72.1043 -80.3117
quadrupole: -0.0043 0.0019 -5.3246
quadrupole: -20.0275 14.1175 5.9100 -0.0043 0.0019 -5.3246
hfenergy: -719.0056521 hartree
pointgroup: C01 [X(C8H8N2O4)]
dipole: -0.0010932 -1.1613707 0.3240937 debye
dipolederiv: -0.7922505 0.1582511 0.1814976 0.0854699 -0.4787134 -0.142908 0.1435343 -0.1490953 -0.3046329 -0.7921373 -0.1578533 -0.1819879 -0.0852623 -0.4781388 -0.1432149 -0.1437911 -0.1492971 -0.3050499 -0.5043479 -0.1479465 0.0168402 -0.0882017 -0.6936718 -0.190279 0.0991233 -0.1495962 -0.2707362 -0.5041045 0.1479618 -0.0168132 0.0881399 -0.6933762 -0.1906745 -0.099332 -0.1502054 -0.2712247 1.4364653 0.136141 -0.2767272 0.2246387 0.9827652 0.3775285 -0.287232 0.3111412 0.3563584 1.4354895 -0.136601 0.2772882 -0.224992 0.9818109 0.3783795 0.2881176 0.3120153 0.3574682 0.2121792 0.0001325 -0.0000864 -0.0001959 0.3454448 0.0114597 0.000124 -0.114532 0.000569 0.1635838 -0.0002664 -0.0000943 0.000105 -0.1658425 -0.054708 -0.0002087 -0.15118 0.0323957 -0.3562072 -0.0154775 0.0556504 -0.1793476 -0.214225 -0.0348912 0.0448981 0.0097429 0.020711 -0.355693 0.0151859 -0.0556115 0.1793456 -0.2143543 -0.0349937 -0.0451022 0.0097766 0.0205807 0.0347099 0.0002031 -0.0000621 0.000001 0.0527379 -0.0073528 -0.0000875 0.1388007 0.03246 0.1202858 -0.0149764 0.0010436 0.2544909 0.0706337 -0.0270579 0.0269845 0.0175239 -0.0684173 0.1203434 0.0148878 -0.0010208 -0.2542548 0.0710813 -0.0270694 -0.0271655 0.0176113 -0.0683865 -0.4069129 0.0001698 -0.0000144 0.000055 0.1574012 -0.050197 -0.0000125 -0.0287823 -0.1376893 -0.0307862 -0.0386186 0.1139409 -0.0074471 0.0512268 -0.0080044 0.0717725 -0.0047757 0.0087186 -0.0308568 0.038723 -0.113898 0.0074002 0.0513432 -0.0081809 -0.0716451 -0.0050855 0.0090335 -0.021854 0.0166928 0.1237884 -0.0461358 0.0966826 0.030338 0.0754036 0.029662 0.0241637 0.1020061 0.000198 -0.0000573 0.0001526 -0.191172 0.0240065 -0.0000681 0.0183163 0.0586071 -0.0222215 -0.0168426 -0.1236619 0.0460172 0.0968742 0.0301121 -0.075294 0.0296467 0.0246146 0.0570902 0.0487407 -0.0103867 0.0146764 0.1111878 0.016599 -0.0126151 -0.0124487 0.1619404 0.0569153 -0.0486973 0.01036 -0.0146377 0.1111374 0.0166158 0.0125483 -0.012482 0.1619279 0.0783032 -0.0000077 0.0000124 -0.0000174 -0.050833 0.0344926 0.0000476 0.0332435 0.156588 unknown
polarizability: 152.2156273|0.0000481|144.277421|0.0038626|5.7876734|62.0294927 unknown
InChI: InChI=1S/C8H8N2O4/c1-2-6-7(9(11)12)4-3-5-8(6)10(13)14/h3-5H,2H2,1H3
charge 0 multiplicity 1
22 atoms
O  3.47994 -0.58333 -0.661943
O  -3.479351 -0.581387 -0.663122
O  2.737445 1.361265 0.257676
O  -2.736115 1.361711 0.259467
N  2.549621 0.154511 -0.153603
N  -2.548859 0.155525 -0.153752
C  0.000129 0.318938 -0.109149
C  -0.000564 1.821488 -0.356769
C  1.195035 -0.461288 -0.018697
C  -1.194766 -0.461107 -0.018669
C  0.000571 2.655374 0.955901
C  1.211723 -1.860819 0.17783
C  -1.211949 -1.860576 0.177935
C  -0.000176 -2.563381 0.296463
H  0.890005 2.096062 -0.945918
H  -0.892767 2.095315 -0.943872
H  -0.900492 2.444267 1.55313
H  -0.000254 3.729874 0.700996
H  0.903245 2.445205 1.551031
H  2.176047 -2.373384 0.222028
H  -2.176391 -2.372945 0.222033
H  -0.000278 -3.643722 0.463804
