program: Gaussian 09
title: 000084118
version: EM64L-G09RevD.01
frameworkgroup: C1[X(C10H14NO5PS)]
method: RPBEPBE
basis: SDD
operation: Freq
keyword: #p
keyword: freq=noraman
keyword: PBEPBE/SDD
title: #p freq=noraman PBEPBE/SDD
converged: YES YES NO NO
title: Mulliken charges:
elementType: S P O O O O O N C C C C C C C C C C H H H H H H H H H H H H H H
charge: -0.201487 0.854791 -0.482921 -0.490187 -0.450878 -0.212864 -0.213408 0.022138 0.023919 -0.650033 -0.659525 0.377421 -0.276264 -0.330516 0.385110 -0.335774 -0.330754 -0.477714 0.233315 0.214952 0.239937 0.233665 0.212095 0.231197 0.233997 0.271406 0.264167 0.286727 0.290119 0.249501 0.246323 0.241548
chargesum: 0.00000
title: Mulliken charges with hydrogens summed into heavy atoms:
elementType: S P O O O O O N C C C C C C C C C C
charge: -0.201487 0.854791 -0.482921 -0.490187 -0.450878 -0.212864 -0.213408 0.022138 0.257233 0.038521 0.017763 0.377421 -0.004858 -0.066350 0.385110 -0.049046 -0.040635 0.259658
polarizability: 2.59082746e+02 -6.10506993e+00 1.75278522e+02 -7.73135145e-01 1.47255685e+01 1.31743813e+02
1716.lowfreq: -7.2827 -4.1195 -0.0017 -0.0014 0.0003 8.3767 14.2727 16.5326 29.5666
frequency: 12.7814 15.9883 29.5124 46.3639 54.9764 69.5253 84.9797 96.1719 109.2073 134.3987 150.2716 168.0612 178.2046 206.1977 219.8020 233.2044 257.6948 272.5502 291.3875 314.1004 347.9434 370.3331 414.0887 416.3984 435.6837 451.4100 489.1383 500.6554 518.2510 576.7680 624.1605 660.9109 673.3623 688.3293 699.1586 729.9910 777.4981 824.1939 826.4774 839.6737 858.4253 898.8928 929.6488 939.7754 960.4869 977.1695 986.2965 998.4513 1093.1310 1094.7144 1106.1148 1113.6893 1133.1634 1155.9179 1164.4440 1179.6591 1205.7803 1223.2805 1287.5979 1322.4380 1337.1473 1358.3652 1385.6751 1399.9175 1402.4704 1424.3029 1426.0277 1454.2685 1459.4204 1460.9816 1468.8950 1470.9195 1471.6453 1482.2765 1593.4430 1603.0834 2987.6849 2991.3587 2994.8291 2997.4377 3088.1266 3094.1387 3095.9912 3101.9587 3107.9796 3136.7982 3168.4930 3171.5888 3187.7039 3191.5964
redmass: 4.9925 3.1938 4.1863 6.6817 3.3581 7.3880 4.4833 8.0248 7.0163 1.4982 2.0196 4.0976 1.1466 2.7517 2.5771 2.6608 6.4493 4.9147 3.6475 6.9823 5.7855 3.5306 3.0712 6.9724 2.9928 5.7643 3.8426 5.4512 6.3516 8.9251 7.4626 4.5437 10.2618 6.7582 8.2287 5.0139 9.9856 3.7108 1.4931 6.8115 1.6490 2.9719 1.2205 1.3481 10.9857 1.3402 1.3484 2.9620 1.6370 3.1939 1.2528 1.2436 1.2951 2.0855 1.4174 1.9438 3.3930 6.8071 1.2701 1.1779 1.4855 7.9505 1.2558 1.2116 9.8741 1.1620 3.7545 1.0485 1.0495 1.0483 1.0481 1.2145 1.8556 1.0515 7.7820 6.8400 1.0302 1.0369 1.0712 1.0489 1.0992 1.1047 1.0994 1.1008 1.1005 1.1037 1.0892 1.0891 1.0963 1.0975
irintensity: 0.0421 0.0380 0.0871 0.0138 4.0864 0.0960 4.0472 3.2462 3.2246 0.8036 2.3661 0.7852 0.1083 5.4096 9.7492 3.0518 4.5525 13.1583 0.4359 9.0713 9.6281 8.9620 0.5772 0.5008 6.3807 22.2892 13.6995 10.4857 20.9063 55.3387 12.6620 17.0794 209.0526 48.1893 116.7009 8.6750 15.7572 265.5059 77.1952 164.9721 71.0045 86.3782 3.1111 0.0424 179.0864 3.7093 0.0277 6.4445 99.8791 15.1170 24.4857 0.8185 0.8668 20.1301 242.5398 20.4052 268.0249 321.8464 1.0328 19.8364 5.1232 87.4174 31.1392 27.3547 24.9737 6.9205 23.6710 5.9074 12.1391 3.1705 14.2250 62.1601 53.5758 14.5564 54.2333 157.5597 42.7218 12.3025 8.9485 15.8145 16.2181 19.8718 27.8468 16.6570 32.4011 12.3952 1.7198 0.8455 0.8427 4.8892
temp: 298.150 k
press: 1.00000 atm
elementType: 16 15 8 8 8 8 8 7 6 6 6 6 6 6 6 6 6 6 1 1 1 1 1 1 1 1 1 1 1 1 1 1
symmnumber: 1
zpe: 615798.1 jmol-1
zpe.correction: 0.234545 hartree
zpe.thermalcorrener: 0.255046 hartree
zpe.thermalcorrenthalpy: 0.255990 hartree
zpe.thermalcorrgfe: 0.181336 hartree
zpe.sumelectzpe: -1558.163135 hartree
zpe.sumelectthermal: -1558.142634 hartree
zpe.sumelectthermalent: -1558.141690 hartree
zpe.sumelectthermalfe: -1558.216344 hartree
dipole: 7.1641 -0.9172 -0.9866
dipole: 7.2896
quadrupole: -146.2683 -103.6388 -128.4603
quadrupole: 8.5265 2.8507 2.3680
quadrupole: -20.1458 22.4836 -2.3378 8.5265 2.8507 2.3680
hfenergy: -1558.3976802 hartree
pointgroup: C01 [X(C10H14N1O5P1S1)]
dipole: 2.809438 -0.4887824 -0.3054137 debye
polarizability: 258.4150583|-9.5969836|177.2351879|2.9500867|12.2791983|130.4548348 unknown
InChI: InChI=1S/C10H14NO5PS/c1-8(2)15-17(18,14-3)16-10-6-4-9(5-7-10)11(12)13/h4-8H,1-3H3
charge 0 multiplicity 1
32 atoms
S  2.091558 -0.657254 2.3619
P  2.191679 -0.690764 0.306997
O  2.516145 0.7677 -0.529838
O  0.757654 -1.21394 -0.568034
O  3.297252 -1.776749 -0.437401
O  -4.763808 1.817107 0.541741
O  -5.513149 -0.211431 -0.187714
N  -4.564318 0.614754 0.110264
C  3.530792 1.745961 0.03352
C  4.947914 1.193077 -0.154705
C  3.256906 3.038534 -0.736899
C  -0.535188 -0.707516 -0.351595
C  -0.785351 0.608527 0.110524
C  -1.597939 -1.588398 -0.668054
C  -3.168523 0.156877 -0.052262
C  -2.113805 1.041594 0.265159
C  -2.925703 -1.154305 -0.523069
C  3.314016 -3.188545 0.022443
H  3.297747 1.866901 1.110968
H  5.685293 1.928733 0.21533
H  5.092853 0.251336 0.402715
H  5.146267 0.998494 -1.222568
H  3.933636 3.834869 -0.37784
H  2.21548 3.37234 -0.593594
H  3.432264 2.889017 -1.816036
H  0.04604 1.284678 0.327641
H  -1.363453 -2.595776 -1.022192
H  -2.347857 2.048265 0.620561
H  -3.770493 -1.806643 -0.757614
H  4.214458 -3.617424 -0.440299
H  2.410399 -3.711215 -0.334421
H  3.383034 -3.242604 1.124472
