program: Gaussian 09
title: 000084158
version: EM64L-G09RevD.01
frameworkgroup: C1[X(C12H14O4)]
method: RPBEPBE
basis: SDD
operation: Freq
keyword: #pfreq=noraman
keyword: PBEPBE/SDD
title: #p freq=noraman PBEPBE/SDD
converged: YES YES NO NO
title: Mulliken charges:
elementType: O O O O C C C C C C C C C C C C H H H H H H H H H H H H H H
charge: -0.272205 -0.272197 -0.274580 -0.274588 0.372201 0.372191 -0.468392 -0.468384 -0.429158 -0.429161 -0.234906 -0.234907 0.330776 0.330783 -0.770318 -0.770276 0.271489 0.232191 0.271504 0.232193 0.236351 0.236350 0.233479 0.233479 0.286709 0.244519 0.241837 0.286646 0.244522 0.241850
chargesum: 0.00000
title: Mulliken charges with hydrogens summed into heavy atoms:
elementType: O O O O C C C C C C C C C C C C
charge: -0.272205 -0.272197 -0.274580 -0.274588 0.372201 0.372191 0.035288 0.035313 -0.192807 -0.192810 -0.001426 -0.001429 0.330776 0.330783 0.002746 0.002742
polarizability: 1.96896368e+02 4.72040170e-03 1.20298870e+02 3.19561831e-03 -1.33736123e+01 1.06623043e+02
1716.lowfreq: -3.5158 -0.0005 -0.0003 0.0003 10.4988 12.2226 53.4137 62.4676 65.6290
frequency: 53.3456 62.4410 65.6177 77.8723 88.5729 100.8365 118.4139 121.2194 164.4376 184.0404 198.5513 227.4586 261.8759 271.1634 296.9405 355.4755 414.4082 418.4228 468.6096 529.7481 561.3674 566.5471 583.1435 589.9316 614.8631 630.5947 731.1466 756.8370 758.7113 817.8048 828.9253 870.4824 877.1186 923.2740 928.9950 948.6304 980.4299 983.8958 992.3885 1000.0202 1003.1513 1051.0388 1051.2780 1051.7791 1117.7632 1176.6494 1180.3256 1202.4638 1204.8514 1210.3323 1214.0683 1242.5768 1287.3604 1354.4583 1357.5617 1384.5433 1386.7003 1388.4724 1442.7620 1454.2152 1456.1976 1459.5675 1461.2823 1468.3692 1474.5229 1491.0295 1590.8582 1616.9898 1635.8960 1640.5792 3000.3240 3000.8635 3020.3978 3020.7835 3084.0585 3085.6743 3097.7047 3098.0982 3119.5925 3123.9203 3139.1703 3139.3165 3142.8716 3164.5620
redmass: 7.0952 5.0691 4.2290 5.2991 5.6502 3.7475 1.0251 1.0262 4.3041 5.2730 8.7854 3.7842 3.6653 3.9122 3.1243 2.5820 3.1779 2.6756 3.6782 4.0557 4.0794 3.5772 3.9976 4.4072 4.9100 5.2056 4.0332 1.2480 3.9061 5.3202 4.1293 4.3218 1.3777 5.3853 6.2955 1.6050 1.8089 2.0763 1.3760 1.9414 1.8812 1.6229 1.6888 2.0438 1.8572 1.0705 2.9121 1.8098 2.4814 1.4248 1.4505 1.7726 1.3163 1.7100 1.3477 1.5683 1.2399 2.4495 2.3350 1.0590 1.0554 1.0608 1.0596 1.1180 1.0905 2.5896 6.8089 6.5086 9.8058 9.4246 1.0391 1.0390 1.0574 1.0571 1.1056 1.1063 1.0929 1.0931 1.0868 1.0898 1.1027 1.1026 1.0929 1.1007
irintensity: 2.6393 0.1304 0.4873 0.3099 0.0012 9.7118 0.3955 0.4775 2.5488 4.7193 1.3432 23.8172 10.1662 0.7640 1.2409 5.3339 0.0409 1.3642 11.1301 9.7855 0.0704 3.7041 13.8835 2.7874 4.8251 0.2081 0.9448 98.3758 0.0692 3.8597 14.3164 5.0439 13.1043 23.4315 148.6450 0.7353 5.5061 9.1430 2.3783 2.8085 96.7181 27.7584 2.6240 0.0394 1.0322 1.2289 29.3173 2.6760 473.4673 163.4868 2.6202 0.2496 4.2495 2.8394 1.4702 36.8145 81.0955 18.3386 2.8380 34.2705 0.3734 20.9535 11.2193 5.9030 33.3889 11.3953 0.3538 0.1544 161.5030 220.0358 5.2422 0.4726 33.5382 7.6672 21.6726 0.4993 10.0149 2.8714 12.6183 2.0559 4.7342 11.0280 24.0078 28.6562
temp: 298.150 k
press: 1.00000 atm
elementType: 8 8 8 8 6 6 6 6 6 6 6 6 6 6 6 6 1 1 1 1 1 1 1 1 1 1 1 1 1 1
symmnumber: 1
zpe: 620380.6 jmol-1
zpe.correction: 0.236290 hartree
zpe.thermalcorrener: 0.252470 hartree
zpe.thermalcorrenthalpy: 0.253414 hartree
zpe.thermalcorrgfe: 0.192141 hartree
zpe.sumelectzpe: -765.394134 hartree
zpe.sumelectthermal: -765.377954 hartree
zpe.sumelectthermalent: -765.377010 hartree
zpe.sumelectthermalfe: -765.438283 hartree
dipole: -2.5018 -0.0014 -0.0001
dipole: 2.5018
quadrupole: -88.2484 -88.5331 -94.7633
quadrupole: -0.0033 -0.0002 0.9157
quadrupole: 2.2665 1.9818 -4.2484 -0.0033 -0.0002 0.9157
hfenergy: -765.6304243 hartree
pointgroup: C01 [X(C12H14O4)]
dipole: 0.0001909 0.9842898 -0.0000995 debye
polarizability: 113.4479054|-0.0245723|196.896361|-15.0203327|-0.0026783|113.4740145 unknown
InChI: InChI=1S/C12H14O4/c1-9(13)15-7-11-5-3-4-6-12(11)8-16-10(2)14/h3-6H,7-8H2,1-2H3
charge 0 multiplicity 1
30 atoms
O  -1.644594 -0.623096 -0.009536
O  1.644538 -0.622377 0.009599
O  -1.236983 -2.509128 1.304741
O  1.238189 -2.508686 -1.304695
C  -0.526273 1.509965 0.483915
C  0.525167 1.510136 -0.483936
C  -1.079471 0.237215 1.083727
C  1.078853 0.237557 -1.083663
C  -1.032601 2.747498 0.947703
C  1.030933 2.747841 -0.947879
C  -0.520342 3.977531 0.477276
C  0.518133 3.977703 -0.477591
C  -1.650161 -2.005518 0.233299
C  1.651106 -2.004804 -0.233285
C  -2.160834 -2.761868 -0.969307
C  2.163239 -2.760743 0.96895
H  -0.306179 -0.348931 1.609245
H  -1.902364 0.453714 1.786705
H  0.305747 -0.348976 -1.609022
H  1.901516 0.454344 -1.786824
H  -1.843362 2.747648 1.68623
H  1.84167 2.748262 -1.686431
H  -0.929726 4.922055 0.851332
H  0.927089 4.922364 -0.851769
H  -1.288301 -3.064035 -1.578706
H  -2.821309 -2.134621 -1.586448
H  -2.684005 -3.673653 -0.641958
H  1.291495 -3.062136 1.579851
H  2.824908 -2.133454 1.584793
H  2.685522 -3.672909 0.641284
