program: Gaussian 09
title: 000084219
version: EM64L-G09RevD.01
frameworkgroup: C1[X(C20H14N2O5S)]
method: RPBEPBE
basis: SDD
operation: Freq
keyword: #p
keyword: freq=noraman
keyword: PBEPBE/SDD
title: #p freq=noraman PBEPBE/SDD
converged: YES YES NO NO
title: Mulliken charges:
elementType: S O O O O O N N C C C C C C C C C C C C C C C C C C C C H H H H H H H H H H H H H H
charge: 0.937896 -0.384522 -0.296465 -0.296157 -0.513900 -0.489934 -0.664797 -0.670892 0.185004 0.150451 0.393100 -0.366861 0.279532 0.353443 0.284075 -0.161055 -0.142167 -0.490116 -0.380609 -0.380109 -0.228081 -0.227283 0.323128 -0.319585 -0.325552 -0.185815 -0.184434 -0.225823 0.286174 0.294100 0.292340 0.358816 0.390194 0.317771 0.392199 0.239128 0.238918 0.253035 0.257165 0.235819 0.235778 0.236090
chargesum: 0.00000
title: Mulliken charges with hydrogens summed into heavy atoms:
elementType: S O O O O O N N C C C C C C C C C C C C C C C C C C C C
charge: 0.937896 -0.384522 -0.296465 -0.296157 -0.513900 -0.489934 0.084212 0.039078 0.185004 0.150451 0.393100 -0.366861 0.279532 0.353443 0.284075 -0.161055 -0.142167 -0.203942 -0.086508 -0.087769 0.011047 0.011636 0.323128 -0.066550 -0.068386 0.050004 0.051344 0.010267
polarizability: 6.99334871e+02 -1.03368589e+01 3.16305577e+02 7.96471621e+00 -7.44331735e+00 1.63322025e+02
1716.lowfreq: -2.4412 -0.0011 0.0006 0.0012 0.2507 4.6713 14.7025 20.2298 24.1208
frequency: 14.2557 20.1987 24.0706 39.4009 49.1708 74.6228 88.1097 110.4587 127.1998 146.7681 149.0912 159.4665 171.7055 198.0323 215.5487 222.8688 262.7898 276.2052 317.2237 328.5173 353.6956 363.2730 378.1898 394.2063 395.4028 411.2876 415.2825 423.3319 427.9067 443.2644 449.6448 475.6686 499.6591 503.1595 508.4517 519.0385 525.4743 559.7705 605.3218 620.8634 632.1994 652.3169 673.0398 678.0511 701.2444 723.2741 740.8693 756.3350 779.2447 780.8413 803.0370 809.6866 812.7381 828.0939 833.0496 860.7325 866.3693 875.0719 884.1428 907.6225 919.8998 930.4628 938.3140 973.8901 977.1132 984.1860 997.1742 998.3125 1013.2117 1014.9344 1020.6320 1042.5434 1073.7878 1086.9360 1104.0856 1144.5966 1148.8467 1172.2370 1172.2783 1184.1566 1198.8574 1249.8358 1278.8389 1299.3130 1300.8407 1341.7814 1350.0731 1380.2411 1387.9013 1406.4868 1418.5256 1428.6064 1437.0263 1450.7874 1454.3605 1462.5633 1484.4948 1527.8678 1537.2875 1564.8768 1565.7219 1579.2843 1585.3271 1596.7426 1608.4041 1639.2472 3134.2518 3136.3264 3136.7629 3144.9911 3153.2329 3158.2459 3166.6708 3169.7077 3174.1574 3177.1451 3225.1807 3256.9638 3448.2446 3622.1024
redmass: 6.3140 6.6554 4.0375 7.6139 8.0540 7.4914 5.5024 6.7525 8.8605 6.2704 6.6964 6.5113 10.8782 9.4713 6.3337 7.3564 5.4657 8.6765 6.4476 5.1729 6.9580 5.7052 9.4044 4.0488 9.2030 8.0053 3.9119 3.2005 6.9448 9.3711 4.3541 6.6091 5.2947 1.9772 2.2532 5.0380 5.3910 4.8619 6.5873 5.5473 4.7901 6.2688 3.4828 1.7763 6.3916 1.3634 1.9412 6.1395 3.7406 2.2004 8.1954 1.8678 5.0011 1.2110 1.2496 1.1507 7.9599 2.2536 6.3972 1.8328 12.2468 1.4777 2.2278 5.8554 1.3811 6.0949 1.3417 1.3875 2.0956 1.3642 2.8978 1.9598 1.5130 2.4422 1.5298 2.3660 1.6903 1.1208 1.0694 2.1396 2.0319 1.6206 1.6820 1.4373 3.4963 3.5524 4.8722 6.6846 9.0846 8.3875 3.0244 4.4894 2.3870 2.8649 2.1086 3.2138 3.4887 6.9227 7.4701 1.9630 5.6562 1.4186 5.7852 2.9617 6.3701 7.4481 1.0854 1.0864 1.0918 1.0892 1.0908 1.0933 1.0944 1.0966 1.0995 1.1008 1.0560 1.0626 1.1000 1.0894
irintensity: 0.3499 0.8185 0.1792 0.0292 0.2783 7.2464 0.6631 3.0538 2.9691 1.0329 5.2208 0.6619 0.0436 0.8123 1.5550 1.9644 2.1196 0.2805 6.9963 6.1105 29.8666 3.8098 46.0804 2.0044 0.0371 9.3218 2.0552 1.0108 77.4700 6.1777 5.1395 27.3388 2.1698 126.9240 20.3096 11.1440 33.2178 3.8230 0.1478 3.8322 12.6456 32.2601 13.2429 36.4299 1.2337 39.4036 2.3916 0.4438 34.0576 11.3059 124.8037 91.7206 22.3167 107.6426 0.4200 158.9917 87.0408 8.5003 8.5484 11.1918 56.3332 5.6048 0.4181 11.0884 0.1090 7.0410 0.3034 5.4299 6.1812 0.0144 42.5148 4.6783 12.0138 9.8382 3.5355 17.0838 35.8905 17.3111 2.5433 10.3420 1.9703 15.8139 12.7719 34.4853 728.6005 45.7376 117.7897 2.6451 6.0950 60.9142 97.9926 24.4604 9.5407 2.3162 5.8002 87.4894 152.1208 51.0368 383.1844 12.8677 1.6821 274.1639 45.8436 48.5961 3.4862 33.4594 1.8253 4.3792 11.6919 9.2137 15.7206 26.0776 1.2785 10.8292 39.0198 33.5159 43.2265 59.0425 176.7696 66.8208
temp: 298.150 k
press: 1.00000 atm
elementType: 16 8 8 8 8 8 7 7 6 6 6 6 6 6 6 6 6 6 6 6 6 6 6 6 6 6 6 6 1 1 1 1 1 1 1 1 1 1 1 1 1 1
symmnumber: 1
zpe: 785967.1 jmol-1
zpe.correction: 0.299359 hartree
zpe.thermalcorrener: 0.323148 hartree
zpe.thermalcorrenthalpy: 0.324092 hartree
zpe.thermalcorrgfe: 0.243715 hartree
zpe.sumelectzpe: -1652.162175 hartree
zpe.sumelectthermal: -1652.138386 hartree
zpe.sumelectthermalent: -1652.137441 hartree
zpe.sumelectthermalfe: -1652.217819 hartree
dipole: -0.1100 0.3775 -2.6166
dipole: 2.6460
quadrupole: -133.8302 -153.4882 -180.2414
quadrupole: 0.2222 10.6381 -1.6131
quadrupole: 22.0231 2.3651 -24.3882 0.2222 10.6381 -1.6131
hfenergy: -1652.4615336 hartree
pointgroup: C01 [X(C20H14N2O5S1)]
dipole: 0.052435 -0.0262793 -1.0393727 debye
polarizability: 698.7085288|-19.534015|313.1294737|-3.4624949|25.3233779|167.1244701 unknown
InChI: InChI=1S/C14H9N2O4S.C6H5O/c15-8-5-9(21(19)20)12(16)11-10(8)13(17)6-3-1-2-4-7(6)14(11)18;7-6-4-2-1-3-5-6/h1-5H,15-16H2;1-5H
charge 0 multiplicity 1
42 atoms
S  2.551276 -0.8013 1.242166
O  3.183343 -0.138261 -0.597696
O  -1.976956 2.48145 1.067812
O  -3.788514 -2.318228 -1.004749
O  2.83721 0.369886 2.353675
O  3.082917 -2.313527 1.514986
N  0.36591 1.478249 1.497975
N  -1.484699 -3.420048 -0.634095
C  -1.46732 0.180163 0.488207
C  -1.94161 -1.067619 -0.059383
C  -0.101489 0.318941 0.949898
C  0.727185 -0.853612 0.813346
C  -3.76257 1.204459 0.099803
C  -1.064052 -2.207608 -0.14335
C  -4.231681 -0.027721 -0.436978
C  -2.364941 1.345481 0.581422
C  -3.33422 -1.203659 -0.525696
C  0.291982 -2.059186 0.292056
C  -4.639678 2.316833 0.17582
C  -5.571623 -0.134328 -0.891066
C  -5.96719 2.20349 -0.277179
C  -6.435087 0.97375 -0.812415
C  4.516581 0.210762 -0.68422
C  4.915773 1.555601 -0.425313
C  5.479952 -0.764156 -1.080544
C  6.263153 1.924884 -0.601913
C  6.823645 -0.381153 -1.251681
C  7.217879 0.960663 -1.013448
H  0.988481 -2.903607 0.231669
H  -4.251881 3.250961 0.592729
H  -5.903467 -1.094224 -1.297856
H  1.309956 1.508757 1.903175
H  -0.318559 2.255868 1.541792
H  -0.843073 -4.208113 -0.691764
H  -2.472244 -3.468874 -0.943063
H  -6.641459 3.064491 -0.216754
H  -7.468961 0.889097 -1.16379
H  4.158857 2.278725 -0.105235
H  5.147966 -1.792983 -1.252932
H  6.575367 2.957987 -0.415621
H  7.567046 -1.121653 -1.56557
H  8.265894 1.252263 -1.14342
