program: Gaussian 09
title: 000008148
version: EM64L-G09RevD.01
frameworkgroup: C1[X(C8H19N)]
method: RPBEPBE
basis: SDD
operation: Freq
keyword: #pfreq=noraman
keyword: PBEPBE/SDD
title: #p freq=noraman PBEPBE/SDD
converged: YES YES NO NO
title: Mulliken charges:
elementType: N C C C C C C C C H H H H H H H H H H H H H H H H H H H
charge: -0.276148 -0.357328 -0.357454 -0.366232 -0.366121 -0.342915 -0.342919 -0.690112 -0.690119 0.203306 0.170346 0.170455 0.203268 0.174069 0.212641 0.212601 0.174134 0.232408 0.192804 0.190965 0.190997 0.192748 0.214766 0.211493 0.208043 0.214760 0.208069 0.211477
chargesum: 0.00000
title: Mulliken charges with hydrogens summed into heavy atoms:
elementType: N C C C C C C C C
charge: -0.043740 0.016323 0.016270 0.020477 0.020613 0.040854 0.040826 -0.055811 -0.055813
polarizability: 1.24417784e+02 7.75707004e-04 8.50337915e+01 1.96960639e-03 7.04505112e-01 7.97618979e+01
1716.lowfreq: -0.0008 0.0005 0.0008 3.1055 8.4352 37.3733 42.0870 60.9005 65.1818
frequency: 37.6779 60.7220 65.0609 94.9647 106.8625 148.8106 150.9290 158.7623 229.6699 229.8390 245.1474 280.6642 388.0905 466.7524 483.0651 687.1462 738.2163 738.8391 798.6941 807.9441 891.6835 895.2424 928.9754 940.3351 1010.5346 1015.0709 1044.5334 1072.7738 1084.7064 1095.8515 1115.9985 1133.8172 1144.9659 1184.6473 1207.4262 1230.2181 1254.5780 1275.1210 1276.4465 1280.2740 1282.9878 1287.6544 1329.2007 1346.2218 1359.0144 1387.2189 1390.6711 1395.0923 1450.4142 1467.4768 1468.9724 1473.8416 1475.1864 1477.1931 1477.2168 1484.2049 1486.9050 1492.1477 1499.6583 2832.9988 2841.8017 2955.8091 2956.3779 2967.9049 2968.0822 2973.3606 2973.5426 2989.9086 2991.9570 3007.5185 3007.6150 3039.8167 3040.2797 3070.0367 3070.2049 3072.8131 3072.9216 3412.5829
redmass: 3.2440 3.4528 1.5158 2.6620 1.7165 1.8474 2.5538 3.0101 1.1286 1.1265 3.7379 3.0907 2.8041 3.7480 2.7634 1.3064 1.0725 1.0743 1.1308 1.1485 1.9381 1.7502 1.1646 1.1996 4.3495 2.1363 3.2997 2.2526 2.1817 1.5577 1.7113 2.4656 4.2031 1.9812 1.4499 1.3649 1.2665 1.1740 1.2781 1.1012 1.0665 1.1790 1.3341 1.5203 1.6062 1.3170 1.2160 1.3819 1.2062 1.0693 1.0694 1.0655 1.0630 1.0423 1.0424 1.0726 1.0758 1.0959 1.0864 1.0717 1.0713 1.0641 1.0643 1.0605 1.0607 1.0364 1.0364 1.0842 1.0825 1.0979 1.0978 1.1013 1.1010 1.1005 1.1005 1.0995 1.0995 1.0737
irintensity: 0.1527 0.1550 0.2075 0.2098 0.8843 2.1591 2.2440 0.1853 0.0403 0.0918 0.0034 1.0432 0.0547 1.0172 6.7388 90.7882 0.0260 22.1559 0.3857 0.7192 2.8362 9.2568 2.4522 1.2046 1.7821 0.1556 0.1470 2.7819 1.8268 28.1634 0.3808 4.9283 52.3531 1.8878 2.7841 0.8676 1.9003 2.8364 0.1359 0.2871 0.2430 0.2632 5.2744 0.2175 18.9842 4.7863 8.0349 6.4400 28.4301 1.3419 0.3720 0.5998 1.7899 2.9833 21.5744 11.2683 18.1662 0.4559 7.6902 39.3497 191.4211 0.7803 16.5929 0.3328 112.7695 55.9867 16.9941 0.5240 90.6962 0.2261 4.6582 0.4861 96.4521 5.9397 172.5970 43.9129 70.2301 2.9552
temp: 298.150 k
press: 1.00000 atm
elementType: 7 6 6 6 6 6 6 6 6 1 1 1 1 1 1 1 1 1 1 1 1 1 1 1 1 1 1 1
symmnumber: 1
zpe: 677552.1 jmol-1
zpe.correction: 0.258066 hartree
zpe.thermalcorrener: 0.270689 hartree
zpe.thermalcorrenthalpy: 0.271633 hartree
zpe.thermalcorrgfe: 0.218454 hartree
zpe.sumelectzpe: -370.206743 hartree
zpe.sumelectthermal: -370.194120 hartree
zpe.sumelectthermalent: -370.193176 hartree
zpe.sumelectthermalfe: -370.246355 hartree
dipole: 0.0012 0.4502 -0.9105
dipole: 1.0157
quadrupole: -59.0086 -60.1360 -59.0941
quadrupole: -0.0012 0.0026 1.8114
quadrupole: 0.4043 -0.7231 0.3188 -0.0012 0.0026 1.8114
hfenergy: -370.4648094 hartree
pointgroup: C01 [X(C8H19N1)]
dipole: 0.000684 0.1880447 -0.3525891 debye
polarizability: 124.4177698|-0.0020456|84.98551|0.0255873|0.8651762|79.8101941 unknown
InChI: InChI=1S/C8H19N/c1-3-5-7-9-8-6-4-2/h9H,3-8H2,1-2H3
charge 0 multiplicity 1
28 atoms
N  -0.000037 -0.236387 -0.005905
C  1.246673 0.561078 -0.004907
C  -1.246708 0.561237 -0.007947
C  2.490069 -0.348796 0.003478
C  -2.490202 -0.348506 0.000501
C  3.818098 0.441405 -0.004217
C  -3.818136 0.441832 -0.00989
C  5.059132 -0.476871 0.001333
C  -5.059288 -0.476285 -0.00241
H  1.246092 1.191371 0.907605
H  1.310964 1.26553 -0.875531
H  -1.309611 1.264233 -0.879817
H  -1.247251 1.193047 0.903503
H  2.461673 -1.018907 -0.882894
H  2.442534 -1.004462 0.894597
H  -2.443542 -1.002681 0.892764
H  -2.460934 -1.020022 -0.884741
H  0.000883 -0.919572 -0.778417
H  3.848369 1.111265 0.879374
H  3.848182 1.101224 -0.895526
H  -3.847752 1.09919 -0.903022
H  -3.848741 1.114116 0.871857
H  5.996987 0.108374 -0.000765
H  5.066418 -1.126184 0.896977
H  5.068397 -1.134754 -0.88834
H  -5.997073 0.109078 -0.004237
H  -5.069503 -1.135111 -0.891362
H  -5.065795 -1.124641 0.893939
