program: Gaussian 09
title: 000084120
version: EM64L-G09RevD.01
frameworkgroup: C1[X(C16H15NO2S)]
method: RPBEPBE
basis: SDD
operation: Freq
keyword: #p
keyword: freq=noraman
keyword: PBEPBE/SDD
title: #p freq=noraman PBEPBE/SDD
converged: YES YES NO NO
title: Mulliken charges:
elementType: S O O N C C C C C C C C C C C C C C C C H H H H H H H H H H H H H H H
charge: 0.241011 -0.265230 -0.236151 -0.243735 0.494535 0.493001 -0.358886 -0.306726 -0.485044 -0.325400 -0.694306 0.335716 -0.287561 -0.435288 -0.375011 0.339910 -0.383629 0.113951 -0.789615 -0.535984 0.295657 0.248006 0.249017 0.227145 0.256508 0.246808 0.271152 0.246157 0.243153 0.237466 0.237177 0.259187 0.220678 0.220278 0.246052
chargesum: 0.00000
title: Mulliken charges with hydrogens summed into heavy atoms:
elementType: S O O N C C C C C C C C C C C C C C C C
charge: 0.241011 -0.265230 -0.236151 -0.243735 0.494535 0.493001 -0.358886 -0.306726 -0.189387 -0.077393 0.038364 0.335716 -0.040753 -0.164137 -0.128853 0.339910 -0.140477 0.113951 -0.055784 0.151025
polarizability: 3.70246089e+02 -6.49538454e-01 2.05273193e+02 -2.80032252e+00 -9.29123861e-01 1.05483799e+02
1716.lowfreq: -3.8460 -0.0023 -0.0017 -0.0009 4.4089 6.8727 29.1390 54.5780 73.1269
frequency: 29.1230 54.5756 73.1239 89.1875 96.2978 122.4607 144.3114 150.1691 171.0133 195.8685 206.6870 235.8894 247.6861 258.8905 282.4229 299.7848 327.5636 345.7725 360.5862 392.4769 428.5656 442.5116 444.1991 476.7362 502.5552 506.3918 526.9559 555.8701 568.9569 591.1752 627.7181 650.4703 666.3326 677.0333 714.0741 732.0213 748.7171 792.7353 816.4579 832.1899 871.9565 895.1603 908.9309 915.9243 944.6431 970.5806 1001.1234 1021.0104 1025.4026 1029.3034 1083.9456 1097.4979 1112.3908 1113.2282 1136.7039 1145.0727 1156.4580 1173.5379 1206.6678 1235.0163 1259.8878 1280.8806 1290.6917 1318.1945 1367.6372 1372.5569 1393.6761 1413.1996 1417.4223 1436.0619 1445.5220 1448.4987 1462.8306 1465.7683 1468.1036 1474.1834 1481.4117 1493.7314 1495.7976 1563.7665 1566.5501 1583.4805 1601.5989 1622.8786 2946.5705 2957.6725 2986.0284 3044.5880 3055.0230 3070.8756 3102.6241 3124.7129 3125.6890 3141.4736 3152.7236 3163.4035 3164.8057 3167.3597 3173.2384
redmass: 5.0696 5.1378 3.9003 4.1805 4.0241 4.3336 1.8733 1.4552 4.4307 5.1157 2.5235 1.5712 4.3107 1.5117 3.6464 4.4709 8.1344 2.1222 7.3135 4.7475 4.5226 3.8658 3.3777 4.8133 4.6757 5.6439 3.6758 4.8432 4.2521 4.0194 4.8196 3.3703 6.2217 7.0245 3.7447 3.9432 4.9742 1.4597 1.3409 6.6836 1.5102 3.7914 1.3660 1.4206 1.3569 1.8863 6.7237 3.4650 1.9070 5.6593 2.5052 2.6733 1.2607 1.3215 1.4847 1.5151 1.4445 1.2792 2.4819 2.2014 1.7491 1.6238 4.7352 2.5715 1.5109 3.3164 8.6720 3.4909 4.0366 1.2411 1.2388 1.1162 1.0498 1.0647 1.8573 1.2754 1.1565 1.5735 1.4185 7.0101 6.9616 7.4984 7.3870 7.0248 1.0470 1.0332 1.0373 1.1039 1.0861 1.0969 1.1013 1.0993 1.0991 1.0883 1.0869 1.0905 1.0923 1.0954 1.0955
irintensity: 0.6035 8.0993 2.0444 2.3719 2.5081 3.4363 1.4135 0.1069 1.4214 4.9543 1.3130 0.6730 2.8855 0.4211 4.3244 2.9050 0.4358 0.3330 1.7566 0.3834 4.6287 0.4598 1.2289 11.3879 15.8349 8.6799 0.8746 4.0620 2.8599 16.0992 10.9552 4.1663 1.7507 1.4715 2.0655 6.8914 36.4383 48.5896 39.4460 21.9018 26.6906 37.5140 2.5602 28.6130 0.1410 20.2713 139.5823 19.4600 2.3097 12.5691 2.0744 14.6726 0.2353 2.8368 34.6926 34.9641 19.3371 5.0275 193.3786 168.7641 28.1473 6.0753 176.0005 112.1280 8.8382 60.9258 46.1539 158.6034 76.5409 50.4228 22.7997 41.0456 20.7083 31.5028 306.5047 19.6791 83.9429 14.4218 120.7747 154.9225 28.5961 62.6531 21.7864 47.2132 57.5688 86.4615 3.2915 49.9607 25.1078 12.4905 16.0482 22.3738 26.3843 3.2790 11.6778 12.8151 0.5401 5.4476 10.6488
temp: 298.150 k
press: 1.00000 atm
elementType: 16 8 8 7 6 6 6 6 6 6 6 6 6 6 6 6 6 6 6 6 1 1 1 1 1 1 1 1 1 1 1 1 1 1 1
symmnumber: 1
zpe: 708974.2 jmol-1
zpe.correction: 0.270034 hartree
zpe.thermalcorrener: 0.288428 hartree
zpe.thermalcorrenthalpy: 0.289373 hartree
zpe.thermalcorrgfe: 0.223629 hartree
zpe.sumelectzpe: -1220.526680 hartree
zpe.sumelectthermal: -1220.508286 hartree
zpe.sumelectthermalent: -1220.507342 hartree
zpe.sumelectthermalfe: -1220.573085 hartree
dipole: -2.5053 0.4934 -0.4494
dipole: 2.5927
quadrupole: -108.7467 -119.2829 -127.4622
quadrupole: -26.0237 2.8463 3.4350
quadrupole: 9.7506 -0.7857 -8.9649 -26.0237 2.8463 3.4350
hfenergy: -1220.7967141 hartree
pointgroup: C01 [X(C16H15N1O2S1)]
dipole: -0.9869056 -0.1751692 0.1892511 debye
polarizability: 370.2365634|0.1430517|204.5046479|3.3146087|-8.7599304|106.2618695 unknown
InChI: InChI=1S/C16H15NO2S/c1-10(18)11-4-7-15-14(8-11)17(2)13-6-5-12(19-3)9-16(13)20-15/h4-9H,1-3H3
charge 0 multiplicity 1
35 atoms
S  -0.623682 2.033684 -1.060706
O  -5.341052 0.679488 0.534051
O  4.823817 -1.816722 0.513822
N  -0.060972 -0.995299 -0.759552
C  1.047677 -0.163706 -0.443975
C  -1.394434 -0.609229 -0.415487
C  0.927657 1.259643 -0.482859
C  -1.797977 0.75598 -0.460829
C  2.307259 -0.71011 -0.102422
C  -2.364524 -1.562012 -0.017343
C  0.195651 -2.409618 -1.072258
C  3.42849 0.117259 0.169383
C  2.025155 2.08831 -0.175969
C  -3.099292 1.150856 -0.120819
C  3.280872 1.527076 0.136926
C  -4.062462 0.176147 0.243167
C  -3.692573 -1.186642 0.291373
C  4.731387 -0.551791 0.498554
C  5.946441 0.315034 0.816035
C  -6.36802 -0.288885 0.923163
H  2.462939 -1.790521 -0.033956
H  -2.088553 -2.616895 0.064759
H  -0.646156 -2.80711 -1.662678
H  0.327377 -3.043323 -0.169711
H  1.108594 -2.486918 -1.684975
H  1.895746 3.175381 -0.201303
H  -3.395381 2.20355 -0.144877
H  4.126389 2.186997 0.352166
H  -4.409024 -1.961359 0.578377
H  5.755304 0.961918 1.692394
H  6.197929 0.975132 -0.034844
H  6.805331 -0.338321 1.031229
H  -6.086078 -0.823905 1.851171
H  -6.557664 -1.022241 0.114863
H  -7.274071 0.308652 1.100829
