program: Gaussian 09
title: 000084057
version: EM64L-G09RevD.01
frameworkgroup: C1[X(C7H15Cl2N2O2P)]
method: RPBEPBE
basis: SDD
operation: Freq
keyword: #p
keyword: freq=noraman
keyword: PBEPBE/SDD
title: #p freq=noraman PBEPBE/SDD
converged: YES YES NO NO
title: Mulliken charges:
elementType: Cl Cl P O O N N C C C C C C C H H H H H H H H H H H H H H H
charge: -0.063224 -0.054859 1.328233 -0.474900 -0.583287 -0.511048 -0.717015 -0.362130 -0.366958 -0.283144 -0.311713 -0.266916 -0.566238 -0.571699 0.223795 0.238967 0.234351 0.209808 0.350206 0.242906 0.195004 0.270238 0.235432 0.271396 0.237876 0.296042 0.265566 0.269172 0.264139
chargesum: 0.00000
title: Mulliken charges with hydrogens summed into heavy atoms:
elementType: Cl Cl P O O N N C C C C C C C
charge: -0.063224 -0.054859 1.328233 -0.474900 -0.583287 -0.511048 -0.366809 0.100632 0.077201 0.154766 0.193957 0.242357 -0.004630 -0.038388
polarizability: 1.44732330e+02 2.92742428e+00 1.45985780e+02 -2.05633474e+00 3.56970832e+00 1.12979303e+02
1716.lowfreq: -24.2330 -9.3831 0.0014 0.0026 0.0029 6.7098 7.5654 36.1645 53.1197
frequency: -19.6769 36.1628 53.0392 63.4622 65.4661 85.4530 105.7688 123.6730 192.5427 202.2750 211.4759 220.7347 254.0077 267.8968 286.9511 326.6730 339.3540 384.0724 410.7056 418.3861 445.2957 479.2323 545.5941 591.1616 656.1079 691.9177 697.8148 767.8841 770.9768 775.8718 816.4248 876.6388 903.8912 939.8954 951.0914 995.9071 1027.9806 1040.1248 1043.0833 1046.4058 1063.6705 1089.9000 1108.7474 1110.3600 1185.4356 1192.1199 1217.3239 1227.3296 1253.9375 1256.6959 1266.4883 1291.9220 1326.1863 1341.8791 1345.7764 1351.8873 1357.6099 1368.1287 1371.0352 1440.4883 1445.3548 1453.7805 1454.8489 1461.9187 1468.4808 1472.0264 2979.3747 2982.3669 2995.7958 2999.9708 3019.8269 3061.1520 3061.6615 3062.2722 3072.1096 3077.3525 3084.0525 3088.9470 3147.3177 3149.5488 3564.1319
redmass: 5.5179 17.4035 6.1423 4.7059 2.7423 2.4103 3.9174 2.6993 3.9167 5.5016 6.7708 4.4153 4.1066 7.4263 2.7376 1.9799 3.0820 2.2328 5.3088 3.4897 4.3123 6.4378 1.8705 5.3868 8.8072 5.5691 4.6637 1.1731 2.0592 1.5652 3.2487 1.6962 2.6270 2.9243 2.5139 1.4721 2.4786 2.6920 2.5456 5.5840 2.7948 2.3478 1.8704 2.4699 1.2053 2.0175 1.2567 1.6002 1.1735 1.1624 1.1805 1.1400 1.1709 1.3390 1.2314 1.2141 1.2509 1.2598 1.2501 1.0925 1.0856 1.0845 1.0878 1.0935 1.0834 1.0757 1.0655 1.0661 1.0613 1.0639 1.0603 1.0587 1.0970 1.0573 1.1006 1.0993 1.1044 1.1007 1.1119 1.1115 1.0769
irintensity: 3.9448 0.8516 0.8535 3.9355 1.7702 1.5940 0.8657 1.6271 1.0916 3.1470 4.1710 3.7483 9.7361 7.6060 11.9853 5.0023 24.0564 45.2918 5.3484 93.5783 23.0569 15.3992 9.3770 29.0998 53.5187 128.7908 111.1472 4.8929 108.0651 10.4980 48.0295 13.5325 46.1086 69.9737 46.7995 2.8064 3.7756 11.1666 72.7514 72.6133 27.4730 36.9501 49.6080 45.4566 18.4942 46.9406 5.8623 6.7894 12.1889 3.1791 4.4302 3.2813 7.8388 2.7733 1.9575 1.9413 10.1506 13.4597 20.8177 12.9699 11.4680 1.8923 6.9495 19.8523 2.9441 20.2184 34.1785 45.2099 30.1894 18.6541 12.3608 2.5429 21.0152 32.8509 32.3635 1.3516 5.5331 28.5536 8.7467 18.2912 44.7999
temp: 298.150 k
press: 1.00000 atm
elementType: 17 17 15 8 8 7 7 6 6 6 6 6 6 6 1 1 1 1 1 1 1 1 1 1 1 1 1 1 1
symmnumber: 1
zpe: 600409.4 jmol-1
zpe.correction: 0.228684 hartree
zpe.thermalcorrener: 0.244507 hartree
zpe.thermalcorrenthalpy: 0.245451 hartree
zpe.thermalcorrgfe: 0.183833 hartree
zpe.sumelectzpe: -1795.881209 hartree
zpe.sumelectthermal: -1795.865386 hartree
zpe.sumelectthermalent: -1795.864442 hartree
zpe.sumelectthermalfe: -1795.926060 hartree
dipole: 3.6460 -1.5027 -5.1076
dipole: 6.4529
quadrupole: -106.4590 -113.4987 -114.6265
quadrupole: -8.1842 -11.1962 5.2572
quadrupole: 5.0691 -1.9706 -3.0984 -8.1842 -11.1962 5.2572
hfenergy: -1796.1098928 hartree
pointgroup: C01 [X(C7H15Cl2N2O2P1)]
dipole: -1.6414683 -0.167033 -1.9294891 debye
polarizability: 142.9002371|1.1988713|147.9207451|1.9747058|-3.3101196|112.8764309 unknown
InChI: InChI=1S/C7H15Cl2N2O2P/c8-2-5-11(6-3-9)14(12)10-4-1-7-13-14/h10H,1-7H2
charge 0 multiplicity 1
29 atoms
Cl 3.132459 3.219936 -0.764163
Cl 2.628143 -3.651769 -0.100096
P  -0.807461 0.464492 0.895743
O  -1.672766 -1.055505 0.999909
O  -0.614599 1.159155 2.313342
N  0.624998 -0.023969 -0.010706
N  -1.691912 1.420604 -0.241529
C  -2.393053 0.759758 -1.373057
C  -3.225123 -0.460515 -0.90492
C  -2.340163 -1.537107 -0.247406
C  1.385783 1.036928 -0.719455
C  1.395077 -1.201373 0.470125
C  2.159928 1.95258 0.249174
C  1.511075 -2.233774 -0.661265
H  -1.64501 0.433384 -2.123124
H  -3.037648 1.512119 -1.859087
H  -4.000667 -0.131238 -0.18884
H  -3.736308 -0.916365 -1.775584
H  -2.089278 2.285994 0.129219
H  -2.932109 -2.401907 0.093138
H  -1.565465 -1.882018 -0.962651
H  0.682068 1.645711 -1.312694
H  2.089146 0.553932 -1.421224
H  0.882976 -1.659136 1.333721
H  2.406744 -0.905805 0.807772
H  1.490763 2.529841 0.903836
H  2.908851 1.413888 0.848175
H  0.5426 -2.691827 -0.905052
H  1.98695 -1.822912 -1.5642
