program: Gaussian 09
title: 000084037
version: EM64L-G09RevD.01
frameworkgroup: C1[X(C6H12N4O4)]
method: RPBEPBE
basis: SDD
operation: Freq
keyword: #p
keyword: freq=noraman
keyword: PBEPBE/SDD
title: #p freq=noraman PBEPBE/SDD
converged: YES YES NO NO
title: Mulliken charges:
elementType: O O O O N N N N C C C C C C H H H H H H H H H H H H
charge: -0.303376 -0.303328 -0.259858 -0.259775 -0.370292 -0.370302 -0.459670 -0.459702 -0.159658 -0.159494 0.184801 0.184716 -0.300515 -0.300535 0.251939 0.251796 0.353726 0.353713 0.213722 0.248439 0.213711 0.248413 0.304278 0.296489 0.304285 0.296478
chargesum: 0.00000
title: Mulliken charges with hydrogens summed into heavy atoms:
elementType: O O O O N N N N C C C C C C
charge: -0.303376 -0.303328 -0.259858 -0.259775 -0.016565 -0.016589 0.141097 0.141061 0.092281 0.092301 0.184801 0.184716 0.161646 0.161589
polarizability: 1.41488210e+02 -8.95855540e+00 9.90860628e+01 -1.74826957e-03 -2.06159526e-03 8.41664527e+01
1716.lowfreq: -14.3081 -3.5918 -3.2544 -0.0004 -0.0003 0.0008 27.9478 39.7432 52.4617
frequency: 27.9476 39.7381 52.4448 87.6961 96.8788 103.6789 115.7232 193.4804 204.2079 206.3620 210.5144 267.4192 279.9579 305.7377 325.3355 385.6672 420.3103 461.3088 491.0596 520.6370 569.5067 602.5293 616.4884 690.2445 707.5323 758.3531 769.4982 792.1018 827.8103 830.1305 901.8438 923.7675 988.6777 998.7040 1067.3229 1076.8485 1126.2115 1132.4002 1137.8815 1140.6653 1206.1973 1211.9751 1229.1646 1229.2752 1256.0632 1276.7544 1282.3127 1288.2976 1335.4986 1338.4182 1365.2895 1366.0435 1408.2218 1417.3179 1466.9260 1467.6905 1605.0005 1605.1465 1645.4293 1645.8852 2929.6638 2933.7425 2998.4767 2998.7859 3069.7809 3069.8322 3315.4773 3315.4882 3460.3345 3460.3388 3525.4231 3526.6601
redmass: 5.1131 4.9998 4.6627 3.9380 5.3230 3.5312 5.6767 4.7429 1.8456 1.2285 2.1638 2.3950 3.0826 5.2497 6.5598 3.3777 6.7373 3.7544 8.6897 2.7847 3.9200 1.4001 3.0591 2.4285 4.1689 5.7714 4.9470 3.0526 3.8107 4.0713 3.1702 3.2573 2.0699 2.3257 2.2983 1.7891 2.2824 1.8181 2.2016 2.2109 1.1342 1.2125 1.1428 1.1369 1.6674 1.5438 1.4047 1.3085 6.7193 1.9674 1.3544 1.4055 1.4889 2.1665 1.0741 1.0745 1.0770 1.0710 7.2503 7.5915 1.0812 1.0813 1.0593 1.0594 1.1063 1.1063 1.0421 1.0421 1.0984 1.0984 1.0769 1.0770
irintensity: 0.5328 2.5072 0.6564 0.0558 1.8603 3.4330 2.7628 2.5704 74.1683 4.6707 56.3263 14.2913 1.3745 1.2061 2.4039 0.5471 41.6960 25.8761 4.3558 35.7260 0.0188 54.9820 59.2852 88.8130 55.7804 20.0650 0.8205 1.0368 49.2397 8.5374 16.0961 33.2700 0.0975 14.6348 21.3958 8.5612 14.8268 1.0170 165.5167 4.3762 7.8695 1.0580 7.2104 0.0261 3.9549 4.2091 0.8800 17.0061 241.2624 1.8179 2.8272 18.8106 8.7454 0.0836 66.0835 0.7579 46.1316 3.3747 22.3602 699.2817 33.8931 9.7390 27.2196 84.2608 2.8850 18.8204 0.7765 4.5427 0.3044 0.4525 109.7776 17.2841
temp: 298.150 k
press: 1.00000 atm
elementType: 8 8 8 8 7 7 7 7 6 6 6 6 6 6 1 1 1 1 1 1 1 1 1 1 1 1
symmnumber: 1
zpe: 530576.9 jmol-1
zpe.correction: 0.202086 hartree
zpe.thermalcorrener: 0.217278 hartree
zpe.thermalcorrenthalpy: 0.218222 hartree
zpe.thermalcorrgfe: 0.158278 hartree
zpe.sumelectzpe: -754.524411 hartree
zpe.sumelectthermal: -754.509219 hartree
zpe.sumelectthermalent: -754.508275 hartree
zpe.sumelectthermalfe: -754.568220 hartree
dipole: -0.0006 -0.0010 -0.1132
dipole: 0.1132
quadrupole: -70.7755 -95.3549 -69.1248
quadrupole: 13.4673 -0.0001 -0.0055
quadrupole: 7.6429 -16.9365 9.2936 13.4673 -0.0001 -0.0055
hfenergy: -754.7264971 hartree
pointgroup: C01[X(C6H12N4O4)]
dipole: -0.000215 -0.0004442 -0.0445224 debye
dipolederiv: -0.5011663 -0.0363577 0.1476912 -0.0514563 -0.339734 0.0484285 0.0546813 0.0239073 -0.452063 -0.5009669 -0.0362857 -0.1476614 -0.0513996 -0.3396519 -0.0483941 -0.0546478 -0.0238654 -0.4520373 -0.8858897 0.1624639 0.0614644 0.4503471 -0.9042664 -0.1258606 0.2079059 -0.2117549 -0.3990607 -0.8858906 0.1625901 -0.0613035 0.449744 -0.9038066 0.1255444 -0.2091956 0.2128891 -0.3991646 -1.2615562 0.257737 -0.1657729 -0.1231751 -0.4374808 -0.0616106 0.0097297 -0.0722719 -0.3920608 -1.2615579 0.2577838 0.1654327 -0.1231296 -0.4372839 0.0616175 -0.0094703 0.0720204 -0.3921927 -0.1912139 0.0002805 -0.1605362 0.0166652 -0.0574435 0.0381626 -0.0642488 0.0258612 -0.1482262 -0.1912814 0.0002605 0.1605548 0.0166422 -0.057424 -0.0381001 0.0642592 -0.0258186 -0.1482619 0.1687482 -0.1617213 0.0850209 -0.2207695 0.171652 -0.1568132 0.0565806 -0.1472113 0.3217213 0.1688357 -0.1616563 -0.0851291 -0.22115 0.1713131 0.1570766 -0.0567603 0.1468291 0.3221081 1.577167 -0.3236277 -0.1815691 -0.211325 0.9519899 0.1975376 -0.1793251 0.2978152 0.2219347 1.5771635 -0.3236051 0.1817848 -0.2108481 0.9516645 -0.1974984 0.1803879 -0.29844 0.222061 0.3624179 0.1045562 -0.0087532 0.1265303 0.2676039 -0.0521603 -0.1748786 -0.0256879 0.5826906 0.3623671 0.1045826 0.0087664 0.1264797 0.2676715 0.0521075 0.174923 0.0255672 0.5826619 0.0224472 0.018841 0.0497875 0.0338864 0.0051882 0.0203534 -0.0415297 0.0549708 -0.1290822 0.0223551 0.0189421 -0.0498093 0.0340159 0.0052128 -0.0203163 0.041609 -0.0549459 -0.129405 0.2536451 -0.0012098 -0.0272995 0.0202487 0.178961 0.0809627 -0.0455102 0.0817795 0.290495 0.2534797 -0.0012407 0.0273135 0.0201403 0.1788608 -0.0809695 0.0455632 -0.0815951 0.290578 0.0122411 -0.0720539 -0.0733841 -0.1248625 -0.0263586 -0.0931577 -0.0156614 -0.0376573 -0.1099447 0.0869309 0.0616737 -0.0229006 0.0974466 -0.0214721 0.0675087 0.0674953 0.0083031 0.0199206 0.0122411 -0.0720702 0.0733708 -0.1248773 -0.0264523 0.0931999 0.0155949 0.0376913 -0.1098943 0.0868974 0.061666 0.0229418 0.0974346 -0.0215394 -0.0676037 -0.0675084 -0.0083866 0.0198757 0.1651858 -0.0687666 0.0345964 -0.0552153 0.1303198 -0.0945874 0.0726821 -0.1258382 0.0639781 0.1910968 0.0579788 0.0487049 0.041895 0.081088 0.0856383 0.1164758 0.1456907 0.1297053 0.1652213 -0.0687591 -0.0346216 -0.0551922 0.1302683 0.0946005 -0.0726918 0.1258535 0.0640537 0.191082 0.057998 -0.0486897 0.0419248 0.0811199 -0.0856663 -0.1164597 -0.1457054 0.1296094 unknown
polarizability: 142.6050458|-5.6260237|97.9692225|0.0038762|-0.0082758|84.1664572 unknown
InChI: InChI=1S/C6H12N4O4/c7-13-1-3-5(11)10-4(2-14-8)6(12)9-3/h3-4,9-10H,1-2,7-8H2
charge 0 multiplicity 1
26 atoms
O  -2.930078 -0.647901 0.842762
O  2.929998 0.647357 0.842893
O  -1.387852 2.274864 0.02466
O  1.387993 -2.274087 0.026078
N  -0.646739 -1.214956 -0.418428
N  0.646783 1.215011 -0.418341
N  -4.36938 -0.65949 1.25762
N  4.369277 0.658885 1.257831
C  -1.387511 -0.031355 -0.907245
C  1.387547 0.031486 -0.907422
C  -0.728637 1.273067 -0.376122
C  0.728716 -1.273285 -0.377088
C  -2.873429 -0.126228 -0.53695
C  2.873449 0.126323 -0.537067
H  -1.332905 0.014971 -2.018263
H  1.333011 -0.014611 -2.018438
H  -1.183485 -1.934109 0.075146
H  1.183644 1.934428 0.074728
H  -3.42202 -0.811679 -1.210677
H  -3.316648 0.884346 -0.582365
H  3.422002 0.81212 -1.210471
H  3.316732 -0.884201 -0.582944
H  -4.435735 0.09963 1.961575
H  -4.475244 -1.574379 1.730388
H  4.435641 -0.100443 1.961561
H  4.475073 1.573637 1.730878
