program: Gaussian 09
title: 000084061
version: EM64L-G09RevD.01
frameworkgroup: C1[X(C7H15Cl2N2O2P)]
method: RPBEPBE
basis: SDD
operation: Freq
keyword: #p
keyword: freq=noraman
keyword: PBEPBE/SDD
title: #p freq=noraman PBEPBE/SDD
converged: YES YES NO NO
title: Mulliken charges:
elementType: Cl Cl P O O N N C C C C C C C H H H H H H H H H H H H H H H
charge: -0.063224 -0.054860 1.328233 -0.474900 -0.583286 -0.511046 -0.717016 -0.362129 -0.366958 -0.283144 -0.311713 -0.266916 -0.566238 -0.571699 0.223795 0.238967 0.234351 0.209808 0.350206 0.242906 0.195004 0.270238 0.235432 0.271396 0.237877 0.296042 0.265566 0.269173 0.264138
chargesum: 0.00000
title: Mulliken charges with hydrogens summed into heavy atoms:
elementType: Cl Cl P O O N N C C C C C C C
charge: -0.063224 -0.054860 1.328233 -0.474900 -0.583286 -0.511046 -0.366810 0.100632 0.077201 0.154766 0.193956 0.242357 -0.004630 -0.038388
polarizability: 1.44732048e+02 2.92725752e+00 1.45986032e+02 -2.05637385e+00 3.56972460e+00 1.12979409e+02
1716.lowfreq: -24.2355 -9.3837 -0.0011 0.0015 0.0026 6.7089 7.5642 36.1644 53.1187
frequency: -19.6806 36.1626 53.0382 63.4617 65.4639 85.4546 105.7688 123.6728 192.5420 202.2743 211.4757 220.7340 254.0080 267.8964 286.9504 326.6729 339.3558 384.0743 410.7056 418.3873 445.2964 479.2317 545.5940 591.1604 656.1060 691.9172 697.8130 767.8832 770.9772 775.8720 816.4245 876.6392 903.8919 939.8957 951.0916 995.9074 1027.9802 1040.1258 1043.0842 1046.4078 1063.6695 1089.9008 1108.7489 1110.3607 1185.4367 1192.1211 1217.3237 1227.3289 1253.9365 1256.6947 1266.4892 1291.9220 1326.1864 1341.8792 1345.7777 1351.8883 1357.6109 1368.1291 1371.0363 1440.4879 1445.3545 1453.7812 1454.8486 1461.9190 1468.4814 1472.0259 2979.3768 2982.3608 2995.7994 2999.9759 3019.8223 3061.1543 3061.6635 3062.2738 3072.1088 3077.3507 3084.0499 3088.9421 3147.3190 3149.5539 3564.1256
redmass: 5.5177 17.4035 6.1418 4.7058 2.7425 2.4103 3.9174 2.6993 3.9168 5.5016 6.7708 4.4153 4.1067 7.4263 2.7376 1.9800 3.0821 2.2328 5.3089 3.4894 4.3121 6.4377 1.8705 5.3867 8.8072 5.5692 4.6636 1.1731 2.0590 1.5653 3.2487 1.6962 2.6270 2.9243 2.5139 1.4721 2.4785 2.6919 2.5452 5.5869 2.7948 2.3478 1.8703 2.4699 1.2053 2.0176 1.2567 1.6002 1.1735 1.1624 1.1805 1.1400 1.1709 1.3390 1.2314 1.2141 1.2509 1.2598 1.2501 1.0925 1.0856 1.0845 1.0878 1.0935 1.0834 1.0757 1.0655 1.0661 1.0613 1.0639 1.0603 1.0587 1.0970 1.0573 1.1006 1.0993 1.1044 1.1007 1.1119 1.1115 1.0769
irintensity: 3.9449 0.8515 0.8534 3.9357 1.7702 1.5942 0.8657 1.6271 1.0915 3.1472 4.1709 3.7481 9.7356 7.6068 11.9855 5.0016 24.0512 45.2905 5.3500 93.5786 23.0600 15.3994 9.3770 29.0995 53.5244 128.7822 111.1563 4.8854 108.0651 10.5032 48.0299 13.5326 46.1081 69.9737 46.7979 2.8061 3.7746 11.1752 72.7162 72.6318 27.4795 36.9503 49.6052 45.4594 18.4939 46.9432 5.8622 6.7892 12.1893 3.1788 4.4301 3.2817 7.8385 2.7733 1.9569 1.9413 10.1504 13.4484 20.8301 12.9699 11.4672 1.8918 6.9503 19.8529 2.9432 20.2191 34.1422 45.2489 30.1856 18.6538 12.3617 2.5333 20.9973 32.8785 32.3619 1.3521 5.5331 28.5555 8.7483 18.2893 44.8002
temp: 298.150 k
press: 1.00000 atm
elementType: 17 17 15 8 8 7 7 6 6 6 6 6 6 6 1 1 1 1 1 1 1 1 1 1 1 1 1 1 1
symmnumber: 1
zpe: 600409.4 jmol-1
zpe.correction: 0.228684 hartree
zpe.thermalcorrener: 0.244507 hartree
zpe.thermalcorrenthalpy: 0.245451 hartree
zpe.thermalcorrgfe: 0.183833 hartree
zpe.sumelectzpe: -1795.881209 hartree
zpe.sumelectthermal: -1795.865386 hartree
zpe.sumelectthermalent: -1795.864442 hartree
zpe.sumelectthermalfe: -1795.926060 hartree
dipole: 3.6460 -1.5028 -5.1076
dipole: 6.4529
quadrupole: -106.4589 -113.4988 -114.6266
quadrupole: -8.1841 -11.1963 5.2570
quadrupole: 5.0692 -1.9707 -3.0985 -8.1841 -11.1963 5.2570
hfenergy: -1796.1098928 hartree
pointgroup: C01 [X(C7H15Cl2N2O2P1)]
dipole: -1.6414711 -0.1669743 -1.9294929 debye
polarizability: 142.9002373|1.1986496|147.9207664|1.9747829|-3.3098409|112.8764856 unknown
InChI: InChI=1S/C7H15Cl2N2O2P/c8-2-5-11(6-3-9)14(12)10-4-1-7-13-14/h10H,1-7H2
charge 0 multiplicity 1
29 atoms
Cl 3.132474 3.219928 -0.764141
Cl 2.628113 -3.651781 -0.100143
P  -0.807467 0.464493 0.895738
O  -1.672787 -1.055499 0.999873
O  -0.614604 1.159126 2.31335
N  0.624993 -0.023969 -0.010714
N  -1.691901 1.420634 -0.241521
C  -2.393046 0.759817 -1.373063
C  -3.225131 -0.460456 -0.904952
C  -2.340186 -1.537069 -0.247453
C  1.385786 1.036928 -0.719452
C  1.395058 -1.201385 0.470107
C  2.159947 1.952559 0.249184
C  1.51104 -2.23378 -0.661291
H  -1.645004 0.433449 -2.123135
H  -3.037632 1.512194 -1.85908
H  -4.000674 -0.131183 -0.188869
H  -3.736317 -0.916284 -1.775626
H  -2.089255 2.286025 0.129239
H  -2.932145 -2.401868 0.093073
H  -1.56549 -1.881979 -0.9627
H  0.682076 1.645727 -1.31268
H  2.08914 0.553934 -1.421233
H  0.882951 -1.659148 1.3337
H  2.406729 -0.905835 0.807755
H  1.490792 2.529812 0.903863
H  2.908875 1.413854 0.848167
H  0.542563 -2.691832 -0.905068
H  1.986905 -1.822913 -1.564229
