program: Gaussian 09
title: 000084237
version: EM64L-G09RevD.01
frameworkgroup: C1[X(C8H14N6O10)]
method: RPBEPBE
basis: SDD
operation: Freq
keyword: #p
keyword: freq=noraman
keyword: PBEPBE/SDD
title: #p freq=noraman PBEPBE/SDD
converged: YES YES NO NO
title: Mulliken charges:
elementType: O O O O O O O O O O N N N N N N C C C C C C C C H H H H H H H H H H H H H H
charge: -0.288816 -0.282594 -0.177883 -0.175729 -0.212289 -0.183030 -0.193981 -0.189662 -0.234695 -0.243616 -0.045839 -0.002196 0.016103 0.155687 0.122978 0.170198 -0.304474 -0.384210 -0.270605 -0.299645 0.330723 0.350782 -0.763481 -0.756012 0.286618 0.305866 0.309517 0.258355 0.256349 0.308284 0.297136 0.253454 0.271061 0.245500 0.276904 0.258710 0.256748 0.277784
chargesum: 0.00000
title: Mulliken charges with hydrogens summed into heavy atoms:
elementType: O O O O O O O O O O N N N N N N C C C C C C C C
charge: -0.288816 -0.282594 -0.177883 -0.175729 -0.212289 -0.183030 -0.193981 -0.189662 -0.234695 -0.243616 -0.045839 -0.002196 0.016103 0.155687 0.122978 0.170198 0.288011 0.183662 0.294028 0.250944 0.330723 0.350782 0.029985 0.037231
polarizability: 1.91445018e+02 1.96913630e+00 1.65279560e+02 6.86299151e-01 -9.39952655e+00 1.59256855e+02
1716.lowfreq: -10.5984 -8.6788 -0.0011 -0.0007 -0.0006 3.7886 28.5680 37.7536 39.9881
frequency: 28.5490 37.7349 39.9373 47.2707 56.3977 66.3351 69.3498 78.7355 90.7518 93.2972 104.4964 111.0249 115.5341 120.9546 121.8254 140.1483 155.5588 171.7271 185.0369 212.3055 227.2927 254.9955 286.8549 317.8275 344.4427 351.3260 356.1337 366.7791 393.6938 409.7250 457.8635 462.2758 553.2389 558.1715 567.7250 579.4788 585.4552 603.2336 605.7586 620.1819 642.9693 662.4646 669.6446 673.4606 674.8756 767.0083 783.5504 801.2417 807.7318 825.3305 877.4371 882.4151 896.9503 918.4211 924.1817 967.8444 992.2205 999.1356 1042.0430 1047.9596 1064.6085 1105.1990 1142.9876 1146.1875 1152.3920 1154.9037 1166.7751 1191.5661 1203.6567 1227.8415 1251.4380 1289.5094 1294.5823 1317.9552 1348.4860 1353.5620 1358.5325 1388.3413 1390.8016 1395.5327 1397.8831 1406.3637 1430.8901 1433.8066 1442.0507 1449.6672 1452.2215 1454.2709 1454.9809 1459.2646 1461.1370 1466.1637 1669.9049 1673.8164 3003.8618 3006.9905 3020.5386 3022.3598 3037.2320 3054.8966 3082.4238 3091.4192 3095.1507 3095.4642 3111.4258 3135.2993 3143.3177 3144.4956
redmass: 7.3348 6.7284 6.8971 8.7983 7.2693 7.6166 7.2160 3.7110 9.5978 4.8459 7.8631 2.2682 3.9323 3.2965 8.4726 1.1331 5.7064 6.4047 6.6614 6.9830 6.1979 6.0257 3.4937 4.5238 3.6238 4.4112 2.8023 4.8096 4.7877 2.0623 4.1379 4.0842 3.5718 4.0742 4.2890 5.0065 5.4046 5.4388 5.4163 6.3603 5.8592 7.9759 13.4220 9.9754 13.0464 5.0908 5.7320 7.2378 7.8162 5.5104 6.4921 9.8795 4.1966 3.0972 3.4272 1.8120 2.2063 2.0653 1.6419 1.6400 2.2782 2.5085 4.4867 3.7934 2.9237 3.9789 4.0531 4.7913 2.9429 3.7701 3.5195 1.4637 1.4490 1.3578 1.2697 1.2384 1.2205 1.2959 1.2379 1.7561 1.7608 1.2875 2.2670 1.6626 1.4518 1.1760 1.1255 1.5520 1.0638 1.0618 1.0939 1.7253 9.7444 9.6661 1.0400 1.0376 1.0595 1.0581 1.0558 1.0587 1.1064 1.1028 1.0939 1.0942 1.1097 1.1059 1.1020 1.1018
irintensity: 3.4605 0.8083 1.9034 1.1242 1.2895 1.0302 2.1698 2.7652 1.0683 1.9945 0.4016 1.3307 3.4287 0.1501 0.5258 1.1649 4.4634 2.2783 4.7215 0.8964 27.5455 4.3326 2.7121 2.1876 2.0429 3.2860 1.8448 6.0069 5.7361 5.9799 7.0701 12.5444 2.3141 3.6108 10.2317 18.6751 22.5762 2.0465 3.8596 16.5410 5.1700 10.9009 2.1169 19.5909 12.6876 46.7782 40.1710 25.9271 65.2040 23.3887 330.4519 182.8264 43.9980 39.6574 222.6604 19.3995 43.5931 47.5036 14.9064 7.4662 45.8815 7.9116 71.2277 470.8861 46.0303 335.5007 104.4758 212.5506 49.7580 69.4179 5.0362 5.0622 1.9408 5.2377 21.7678 13.7249 11.1637 15.5257 78.0667 116.6250 72.9170 7.0988 163.8811 123.2323 94.8031 36.6439 62.8543 29.4133 38.7366 26.5001 13.0594 34.2960 184.1157 178.6108 1.9181 3.2013 9.0920 9.7221 30.3965 14.0128 0.3333 6.4902 2.7145 2.4467 5.2354 3.7397 5.7864 4.4751
temp: 298.150 k
press: 1.00000 atm
elementType: 8 8 8 8 8 8 8 8 8 8 7 7 7 7 7 7 6 6 6 6 6 6 6 6 1 1 1 1 1 1 1 1 1 1 1 1 1 1
symmnumber: 1
zpe: 696516.5 jmol-1
zpe.correction: 0.265289 hartree
zpe.thermalcorrener: 0.290421 hartree
zpe.thermalcorrenthalpy: 0.291365 hartree
zpe.thermalcorrgfe: 0.208275 hartree
zpe.sumelectzpe: -1391.822229 hartree
zpe.sumelectthermal: -1391.797098 hartree
zpe.sumelectthermalent: -1391.796154 hartree
zpe.sumelectthermalfe: -1391.879243 hartree
dipole: -0.6774 -2.3319 -6.7924
dipole: 7.2134
quadrupole: -150.5163 -153.2649 -139.1086
quadrupole: -0.9948 6.3851 3.9312
quadrupole: -2.8864 -5.6350 8.5213 -0.9948 6.3851 3.9312
hfenergy: -1392.0875184 hartree
pointgroup: C01 [X(C8H14N6O10)]
dipole: -2.3169104 1.638068 -0.0526365 debye
polarizability: 154.9220295|7.6429904|175.9192388|4.5661532|8.1501058|185.1401647 unknown
InChI: InChI=1S/C8H14N6O10/c1-7(15)23-5-10(13(19)20)3-9(12(17)18)4-11(14(21)22)6-24-8(2)16/h3-6H2,1-2H3
charge 0 multiplicity 1
38 atoms
O  0.455663 -1.412035 -0.276056
O  -2.132405 0.697983 -1.127994
O  2.413667 2.009354 2.010855
O  0.778643 1.980184 3.620662
O  1.234139 2.125244 -2.517798
O  -0.541843 -0.838157 2.736709
O  1.995643 -0.042864 -2.677247
O  -2.123628 -1.946898 1.501475
O  2.019259 -3.121983 -0.602906
O  -2.771214 -1.389283 -1.971952
N  0.215235 1.717597 1.369605
N  1.293515 0.802599 -0.64207
N  -1.846486 0.351492 1.254125
N  1.194437 1.915794 2.411033
N  1.531016 0.964064 -2.022734
N  -1.481633 -0.901291 1.862602
C  0.640507 1.983613 0.00881
C  -1.195049 1.554075 1.773367
C  1.590343 -0.469902 -0.036225
C  -2.797147 0.363704 0.163263
C  0.827304 -2.761457 -0.561654
C  -2.182164 -0.305072 -2.144719
C  -0.398152 -3.616852 -0.750651
C  -1.454407 0.143597 -3.38441
H  -0.254007 2.245417 -0.582336
H  1.351323 2.827125 -0.012823
H  -1.192823 1.550133 2.875656
H  -1.792309 2.407651 1.405426
H  1.695305 -0.33493 1.049495
H  2.50529 -0.906857 -0.469187
H  -3.272643 -0.628709 0.088282
H  -3.538924 1.162841 0.321799
H  -0.890741 -3.766059 0.227339
H  -0.101108 -4.591494 -1.163784
H  -1.136955 -3.124634 -1.403871
H  -1.264975 1.226244 -3.384654
H  -2.039145 -0.144381 -4.272932
H  -0.482831 -0.381456 -3.446701
