program: Gaussian 09
title: 000084136
version: EM64L-G09RevD.01
frameworkgroup: C1[X(C21H27N3OS)]
method: RPBEPBE
basis: SDD
operation: Freq
keyword: #p
keyword: freq=noraman
keyword: PBEPBE/SDD
title: #p freq=noraman PBEPBE/SDD
converged: YES YES NO NO
title: Mulliken charges:
elementType: S O N N N C C C C C C C C C C C C C C C C C C C C C H H H H H H H H H H H H H H H H H H H H H H H H H H H
charge: 0.269115 -0.361551 -0.103966 -0.410823 0.006617 -0.424168 -0.371474 0.279146 0.265989 -0.521525 -0.324613 -0.329694 0.357952 0.089957 0.482983 -0.406756 -0.595792 -0.444346 0.385746 -0.671862 -0.670774 -0.827209 -0.462349 0.136418 -0.766159 -0.781393 0.206470 0.222897 0.233244 0.212958 0.382476 0.204784 0.188508 0.207909 0.191667 0.251849 0.231238 0.209932 0.227859 0.207805 0.208441 0.226476 0.207675 0.228447 0.241197 0.240464 0.239647 0.254869 0.201427 0.252401 0.256617 0.231498 0.231778
chargesum: 0.00000
title: Mulliken charges with hydrogens summed into heavy atoms:
elementType: S O N N N C C C C C C C C C C C C C C C C C C C C C
charge: 0.269115 -0.361551 -0.103966 -0.028346 0.006617 0.005199 0.074729 0.279146 0.265989 -0.521525 0.068679 0.069881 0.357952 0.089957 0.482983 -0.154908 -0.595792 -0.213108 0.385746 -0.026266 -0.028183 -0.117102 -0.222701 0.136418 -0.057463 -0.061500
polarizability: 4.20075036e+02 -3.19154247e+01 3.34864671e+02 -1.46474800e+00 4.05738165e+00 1.58427917e+02
1716.lowfreq: -50.5057 -12.5097 -0.0006 0.0013 0.0016 0.5234 6.3729 10.6268 18.5036
frequency: -50.4603 -6.7178 18.4606 27.3702 33.2416 41.7350 61.4211 71.6674 74.2316 94.0531 124.5265 148.4558 158.8145 164.5474 166.7262 172.3996 180.7748 195.5421 215.8318 233.4275 241.3000 249.7452 265.3265 281.4290 292.7998 299.7165 305.5527 328.7946 347.5552 361.9957 393.8762 402.7390 428.1022 441.2976 454.4431 460.9065 477.2738 500.0036 504.9018 522.8775 546.3641 553.3071 572.5336 592.7882 617.1911 637.7681 689.3221 725.3023 746.6254 752.1997 789.5490 793.8279 796.1038 801.8334 817.6431 818.7706 833.8241 858.1837 883.5766 886.4046 915.2762 941.8466 947.7303 954.8212 992.8602 993.5978 1019.2974 1029.3549 1040.8403 1044.1186 1047.6135 1054.2684 1063.9679 1074.7552 1082.5979 1084.3283 1091.2383 1118.4848 1123.0926 1161.5481 1169.9240 1200.4748 1207.6808 1237.4192 1240.5811 1249.6504 1272.7839 1279.9008 1287.4285 1293.6686 1307.9453 1319.5426 1324.0978 1345.7923 1355.9310 1362.0318 1366.5711 1368.0253 1384.3132 1386.1935 1386.8578 1389.7718 1401.6406 1402.6489 1410.2650 1421.3669 1444.4532 1450.3284 1460.4700 1460.7129 1462.6714 1466.7487 1467.0532 1470.0391 1471.7222 1475.0639 1480.8078 1484.5873 1488.1250 1490.2206 1494.9341 1523.3899 1534.5951 1574.8315 1586.2935 1620.0468 2852.9907 2859.5922 2875.2668 2941.1835 2965.4108 2982.9659 2983.8925 2985.5783 2992.7687 2992.8172 3023.4873 3034.8344 3036.5285 3045.5176 3063.3135 3075.1357 3076.7900 3083.4568 3090.7352 3091.3245 3091.7422 3092.1698 3121.0813 3125.7268 3142.0225 3168.6985 3174.3211
redmass: 1.0176 3.2814 4.4117 4.8083 3.6283 4.1902 2.9391 2.0837 2.8669 4.7177 2.5158 1.8695 1.4670 3.1396 2.6179 3.1825 1.7891 4.6220 1.3192 3.7354 2.6887 1.1366 3.2334 2.1712 2.8186 4.6230 2.5280 3.5706 4.7971 3.8622 4.9028 5.0832 3.3790 7.1885 7.1941 2.9916 4.4259 4.0050 4.2342 4.4299 5.3368 4.3460 3.9267 3.8513 4.8413 6.3746 5.0489 4.6528 3.6672 3.1850 1.3274 1.1410 1.8967 1.6092 6.0542 1.9491 1.1765 6.2377 1.2756 5.9880 1.8945 4.4050 1.3287 3.3677 1.7630 2.0028 1.7730 1.5255 1.5823 1.4875 1.6201 2.8381 1.7443 1.8785 2.6484 2.3605 4.3073 3.2434 2.0667 1.5315 1.5533 1.6583 2.2460 1.5824 4.3825 2.4418 1.8027 1.1983 1.2598 1.2199 2.8453 7.2812 1.5626 3.9795 3.8432 1.3635 1.4408 4.0834 1.4626 1.2421 1.2432 1.3034 1.2416 1.3347 2.8138 3.6166 1.0500 1.2596 1.1744 1.2598 1.0560 1.0437 1.0466 1.0581 1.2229 1.0729 1.0711 1.0737 1.1774 1.1264 1.9994 4.3919 2.8411 3.6069 4.0062 7.4866 1.0721 1.0714 1.0707 1.0606 1.0381 1.0357 1.0357 1.0383 1.0513 1.0835 1.0875 1.0873 1.0974 1.0905 1.0970 1.0985 1.0980 1.0974 1.0955 1.1003 1.1004 1.1003 1.0983 1.0896 1.0921 1.0824 1.0931
irintensity: 0.4212 0.0469 0.0683 2.2473 0.1362 0.2832 0.1911 0.2226 0.1588 0.0241 1.4146 0.7215 0.2687 2.7032 1.0551 1.7638 1.2651 0.5798 0.1466 0.2389 0.8093 0.6258 0.4374 0.8373 3.6030 3.3819 1.0540 3.2852 0.4181 4.9955 1.2178 1.9319 1.1287 9.5006 13.0249 3.2071 5.1070 4.4782 10.6723 12.4284 2.3382 2.8684 0.8238 5.1794 8.9875 0.1234 0.3207 7.1728 7.2426 3.0767 22.5829 3.5228 17.2234 2.0171 4.7709 43.0339 36.0464 32.1135 10.5631 8.9494 0.9965 2.8420 0.0337 20.6532 21.8920 0.2339 19.9430 0.0863 4.8609 5.9702 12.1955 5.4290 27.0685 15.4413 72.1019 5.7872 14.2648 2.2080 7.3385 2.4002 11.2677 33.7012 41.4077 12.2481 28.7468 35.4130 27.8762 28.9506 42.3342 47.6252 124.0951 4.4381 12.7829 107.9822 29.5207 1.2344 14.3119 47.4584 9.7431 26.1961 20.2254 49.4373 16.0562 23.9143 60.8428 2.3486 13.7966 165.1603 22.0825 12.4724 8.8355 16.1885 14.8156 1.1506 42.5632 28.5170 65.9932 1.9044 90.9018 30.3795 125.8082 189.0529 122.1985 423.6470 24.5746 265.5078 36.1381 104.2997 133.5528 92.3207 38.7563 32.0605 33.7974 19.2257 37.7168 20.6220 19.6448 19.5523 16.7173 34.8407 16.1031 42.1632 86.9019 21.7492 7.3126 35.7397 27.9489 55.4818 8.2938 23.7346 19.4238 111.8530 27.9279
temp: 298.150 k
press: 1.00000 atm
elementType: 16 8 7 7 7 6 6 6 6 6 6 6 6 6 6 6 6 6 6 6 6 6 6 6 6 6 1 1 1 1 1 1 1 1 1 1 1 1 1 1 1 1 1 1 1 1 1 1 1 1 1 1 1
symmnumber: 1
zpe: 1145350.0 jmol-1
zpe.correction: 0.436241 hartree
zpe.thermalcorrener: 0.461725 hartree
zpe.thermalcorrenthalpy: 0.462670 hartree
zpe.thermalcorrgfe: 0.379774 hartree
zpe.sumelectzpe: -1452.061525 hartree
zpe.sumelectthermal: -1452.036041 hartree
zpe.sumelectthermalent: -1452.035097 hartree
zpe.sumelectthermalfe: -1452.117992 hartree
dipole: -1.9600 -1.6269 -0.3370
dipole: 2.5694
quadrupole: -149.3995 -147.0139 -166.0331
quadrupole: -8.6094 1.9016 0.1012
quadrupole: 4.7493 7.1349 -11.8842 -8.6094 1.9016 0.1012
hfenergy: -1452.4977662 hartree
pointgroup: C01 [X(C21H27N3O1S1)]
dipole: -0.7421931 0.6566069 0.1997352 debye
polarizability: 422.7560469|27.3584043|329.2153746|6.4581059|22.7666633|161.396203 unknown
InChI: InChI=1S/C21H27N3OS/c1-6-24(7-2)11-10-22-16-9-8-13(3)20-18(16)19(25)17-14(4)12-15(5)23-21(17)26-20/h8-9,12,22H,6-7,10-11H2,1-5H3
charge 0 multiplicity 1
53 atoms
S  3.288514 -1.87517 -0.225195
O  0.216683 1.450785 0.284673
N  -5.37967 0.90052 0.121621
N  -1.750564 -0.119548 -0.04863
N  4.903715 0.152215 0.101336
C  -3.907791 1.065056 0.077981
C  -3.202429 -0.29325 -0.124606
C  0.602582 -0.883746 -0.131289
C  -0.841857 -1.139085 -0.209306
C  1.473692 -2.011948 -0.303456
C  -6.119476 2.046046 -0.474078
C  -5.874898 0.529091 1.476491
C  2.52554 0.853466 0.171892
C  1.077376 0.490554 0.112912
C  1.011736 -3.330295 -0.54306
C  -1.297772 -2.469771 -0.457123
C  3.570898 -0.106739 0.043303
C  -0.390385 -3.521904 -0.616288
C  2.955719 2.222124 0.370061
C  -6.049619 2.069673 -2.012825
C  -7.19935 -0.257018 1.438254
C  1.96151 -4.501072 -0.717582
C  4.343848 2.478493 0.423141
C  5.299843 1.440287 0.292519
C  2.025014 3.408514 0.52284
C  6.786903 1.706299 0.356854
H  -3.510968 1.553754 1.00256
H  -3.643009 1.726483 -0.766751
H  -3.509992 -0.704924 -1.107292
H  -3.551996 -1.012534 0.64664
H  -1.310839 0.806479 0.139377
H  -7.178603 1.952447 -0.172976
H  -5.759908 3.023613 -0.062674
H  -5.104476 -0.103358 1.956112
H  -5.988035 1.432874 2.127629
H  -2.370172 -2.667385 -0.521716
H  -0.770931 -4.533301 -0.803762
H  -5.011955 2.177148 -2.377831
H  -6.459443 1.131601 -2.42569
H  -6.633096 2.919895 -2.412941
H  -8.017391 0.333068 0.986866
H  -7.076722 -1.17746 0.841441
H  -7.513563 -0.53489 2.461746
H  1.398175 -5.432295 -0.896909
H  2.648819 -4.352722 -1.573197
H  2.594841 -4.6579 0.177352
H  4.692554 3.505981 0.570386
H  1.358889 3.289229 1.393431
H  2.615591 4.335203 0.636421
H  1.349389 3.507931 -0.342905
H  7.338747 0.763459 0.224932
H  7.09913 2.416754 -0.431142
H  7.069502 2.15227 1.328755
