program: Gaussian 09
title: 000001908
version: EM64L-G09RevD.01
frameworkgroup: C1[X(C13H12N4O5S)]
method: RPBEPBE
basis: SDD
operation: Freq
keyword: #p
keyword: freq=noraman
keyword: PBEPBE/SDD
title: #p freq=noraman PBEPBE/SDD
converged: YES YES NO NO
title: Mulliken charges:
elementType: S O O O O O N N N N C C C C C C C C C C C C C H H H H H H H H H H H H
charge: 0.992523 -0.257206 -0.254899 -0.566946 -0.497578 -0.499069 -0.169024 -0.412874 -0.217345 -0.077944 0.108855 0.093512 0.108362 0.133613 0.389366 0.210425 -0.614503 -0.347834 -0.346736 -0.596585 -0.068599 -0.233023 -0.241138 0.345149 0.275527 0.248299 0.248499 0.290730 0.219740 0.268853 0.254085 0.253981 0.286805 0.287656 0.385324
chargesum: 0.00000
title: Mulliken charges with hydrogens summed into heavy atoms:
elementType: S O O O O O N N N N C C C C C C C C C C C C C
charge: 0.992523 -0.257206 -0.254899 -0.181622 -0.497578 -0.499069 -0.169024 -0.067725 -0.217345 -0.077944 0.108855 0.093512 0.108362 0.133613 0.389366 0.210425 0.157822 -0.057104 -0.126996 0.180334 -0.068599 0.053783 0.046518
polarizability: 4.32985420e+02 -6.90341766e+00 2.11760452e+02 1.23795657e+00 3.08897000e-01 1.07925068e+02
1716.lowfreq: -9.0813 -2.9716 -2.3060 0.0012 0.0015 0.0024 18.2110 28.3841 45.1720
frequency: 17.6776 28.3725 45.1438 53.2774 71.2416 101.1266 107.4484 108.6358 118.4251 129.9839 145.9841 157.9933 173.2136 188.4890 216.5950 229.7313 280.3807 280.9425 291.1158 315.0774 325.0582 353.0109 355.4184 362.5815 386.9304 387.6343 406.7741 428.6774 464.6213 474.0898 491.3126 509.8559 553.7626 573.9359 617.5948 644.4734 670.6459 674.0506 696.3753 705.4747 714.2667 744.2658 748.2081 767.1165 833.0909 834.7466 867.6872 924.3897 930.9945 966.8696 968.8572 970.5168 990.4059 1001.7489 1038.2565 1044.1684 1057.0836 1077.2826 1108.7358 1118.6501 1128.5094 1132.0920 1188.9659 1193.6271 1226.5849 1241.2128 1275.8281 1287.1399 1299.5904 1329.6709 1377.5209 1392.2051 1410.8183 1420.1548 1425.3803 1438.7182 1471.5332 1473.8649 1478.5604 1480.7443 1501.8818 1534.3030 1578.4989 1588.1791 1600.9963 1616.4038 1652.9740 3008.5200 3014.4953 3098.8825 3107.8984 3137.7654 3140.4588 3140.5627 3160.9513 3168.9107 3180.2183 3480.0858 3588.8275
redmass: 7.3069 7.6141 3.9324 7.6519 5.7120 1.4710 1.2077 2.7599 2.2866 8.9146 7.1130 9.5499 1.5221 4.8548 8.0468 4.0518 3.7842 4.6204 4.9755 5.5813 5.3865 4.8930 7.3148 8.0452 6.5383 8.1682 2.9146 9.3585 6.2613 8.0832 7.8044 4.1905 7.4664 7.0890 7.1208 4.0642 5.4854 1.5474 6.1435 10.3041 7.3605 10.4954 3.3319 4.8895 3.6901 1.9524 1.4801 5.3961 5.1821 6.3060 3.6338 1.6157 5.1832 1.3773 3.2147 1.3132 2.2039 2.3410 4.2505 1.4050 1.3069 1.2986 1.2041 2.8748 2.8220 2.5596 3.5524 4.0102 1.6273 3.2771 5.0388 9.4011 3.1994 1.3115 1.4162 2.0566 1.0453 1.2199 1.0790 1.0423 3.3687 4.6526 8.4674 7.5624 5.9740 10.1192 10.3254 1.0336 1.0327 1.1028 1.1022 1.0893 1.1026 1.1013 1.0896 1.0959 1.0970 1.0661 1.0816
irintensity: 0.6236 0.8378 1.0582 1.1814 0.2592 0.4124 0.3584 1.1628 3.3762 1.2770 1.5752 0.8114 53.1386 13.6966 10.7373 20.9983 30.7708 51.5127 6.3172 9.8420 18.8258 8.1555 6.3644 3.6222 0.4964 17.3277 0.1801 69.4739 14.2036 35.4271 26.1361 35.2886 121.6159 84.2855 0.1457 2.4745 8.5580 98.4772 0.5620 11.6948 25.9534 9.1955 9.0107 0.7371 105.4883 24.8443 39.5779 9.5645 3.7249 83.0171 31.8619 12.0233 0.1365 0.5522 46.1887 48.1196 113.2953 4.8621 27.4419 8.9997 0.2173 0.1757 4.8192 7.4145 5.0434 75.1406 15.9601 131.1412 19.3214 84.6883 1.2201 1.5859 38.9988 22.2989 70.3397 133.2224 18.6023 3.4619 3.7221 18.5176 106.5687 40.2891 127.8080 16.7508 182.1315 698.8810 484.5282 27.5220 29.6991 16.5137 15.1042 10.5845 0.9185 0.3828 2.0010 4.6536 0.7084 49.8018 63.5159
temp: 298.150 k
press: 1.00000 atm
elementType: 16 8 8 8 8 8 7 7 7 7 6 6 6 6 6 6 6 6 6 6 6 6 6 1 1 1 1 1 1 1 1 1 1 1 1
symmnumber: 1
zpe: 644930.8 jmol-1
zpe.correction: 0.245641 hartree
zpe.thermalcorrener: 0.267548 hartree
zpe.thermalcorrenthalpy: 0.268492 hartree
zpe.thermalcorrgfe: 0.192929 hartree
zpe.sumelectzpe: -1493.991405 hartree
zpe.sumelectthermal: -1493.969499 hartree
zpe.sumelectthermalent: -1493.968555 hartree
zpe.sumelectthermalfe: -1494.044118 hartree
dipole: 1.2037 -0.0174 1.3723
dipole: 1.8255
quadrupole: -176.8351 -141.7660 -143.3906
quadrupole: 1.4466 -13.6311 0.4589
quadrupole: -22.8379 12.2312 10.6067 1.4466 -13.6311 0.4589
hfenergy: -1494.2370466 hartree
pointgroup: C01 [X(C13H12N4O5S1)]
dipole: 0.4758108 0.038216 0.5366158 debye
polarizability: 432.6106106|-11.4290427|211.1279104|0.9213017|-10.2250419|108.9324185 unknown
InChI: InChI=1S/C13H12N4O5S/c1-16-11-9(12(18)17(2)13(16)19)14-10(15-11)7-3-5-8(6-4-7)23(20,21)22/h3-6,14,20H,1-2H3
charge 0 multiplicity 1
35 atoms
S  -5.931981 0.182222 -0.093288
O  3.595833 -2.794539 0.312036
O  5.767036 1.378635 -0.117966
O  -6.137132 0.37668 1.744096
O  -6.423594 1.544366 -0.814113
O  -6.536632 -1.252334 -0.533385
N  3.420476 1.382065 -0.137582
N  0.971961 -1.171391 0.111881
N  4.672065 -0.682889 0.095639
N  0.959892 1.092284 -0.127796
C  2.303965 -0.767551 0.080816
C  2.261174 0.629057 -0.067602
C  0.181632 -0.031643 -0.015662
C  3.518595 -1.535487 0.17544
C  -1.282222 -0.018689 -0.027328
C  4.682349 0.737166 -0.057917
C  3.357623 2.848675 -0.295653
C  -1.942362 1.237518 -0.144115
C  -2.053769 -1.211305 0.066086
C  6.007786 -1.319684 0.178654
C  -4.064478 0.106094 -0.055475
C  -3.34694 1.309954 -0.156112
C  -3.460779 -1.156586 0.055414
H  0.672084 -2.140322 0.216218
H  4.390376 3.224927 -0.318871
H  2.808391 3.296533 0.549236
H  2.838503 3.106293 -1.23395
H  -1.331814 2.141399 -0.220534
H  -1.573921 -2.192854 0.148288
H  5.848755 -2.400495 0.304797
H  6.569095 -0.908085 1.032911
H  6.580578 -1.118014 -0.741019
H  -3.870301 2.2658 -0.254381
H  -4.071209 -2.062643 0.115508
H  -7.117232 0.459742 1.933528
