program: Gaussian 09
title: 000083940
version: EM64L-G09RevD.01
frameworkgroup: C1[X(C13H14Cl2N2O6)]
method: RPBEPBE
basis: SDD
operation: Freq
keyword: #p
keyword: freq=noraman
keyword: PBEPBE/SDD
title: #p freq=noraman PBEPBE/SDD
converged: YES YES NO NO
title: Mulliken charges:
elementType: Cl Cl O O O O O O N N C C C C C C C C C C C C C H H H H H H H H H H H H H H
charge: 0.017509 0.033298 -0.444776 -0.300538 -0.213216 -0.225216 -0.206967 -0.204174 -0.360307 0.028090 -0.170382 -0.234427 -0.318234 0.487849 -0.347360 -0.407321 0.349017 -0.355721 -0.364818 0.378468 -0.708004 0.315745 -0.756581 0.302963 0.239910 0.264327 0.268833 0.340169 0.287914 0.251971 0.352100 0.287647 0.288355 0.364390 0.256300 0.246391 0.256796
chargesum: 0.00000
title: Mulliken charges with hydrogens summed into heavy atoms:
elementType: Cl Cl O O O O O O N N C C C C C C C C C C C C C
charge: 0.017509 0.033298 -0.092676 -0.300538 -0.213216 -0.225216 -0.206967 -0.204174 -0.020138 0.028090 0.132581 0.005483 0.214926 0.487849 -0.059447 -0.155350 0.349017 -0.068074 -0.076462 0.378468 -0.343615 0.315745 0.002906
polarizability: 2.65275306e+02 -1.42714465e+00 2.05105342e+02 1.58037704e+01 -1.70621286e+01 1.34867885e+02
1716.lowfreq: 0.0015 0.0021 0.0023 2.4409 3.5781 8.0429 18.0532 20.9940 22.4334
frequency: 17.9405 20.9499 22.4223 30.0793 33.9506 38.4861 51.7714 63.9416 70.5672 72.4093 86.7810 122.1529 131.9630 157.2491 163.8416 181.8175 215.2287 221.9032 240.9520 257.9847 278.7296 304.3707 345.7619 374.0553 391.9420 403.1400 410.5880 419.9393 441.7367 481.6703 513.9056 523.1100 564.1595 577.1130 589.1646 615.5479 625.8045 636.1059 659.2232 675.1343 677.8187 704.4087 742.0852 749.0159 771.6222 816.2165 831.2797 857.5604 867.1791 882.8627 912.2373 971.9774 987.5338 993.9823 1002.3300 1006.7589 1009.3059 1013.3567 1044.6465 1084.8425 1091.7461 1111.8067 1121.2082 1160.5971 1178.8455 1182.8728 1189.4890 1197.5379 1214.2281 1220.5935 1224.9604 1234.9561 1266.4045 1298.6844 1312.8047 1333.1614 1357.6777 1362.9215 1380.6833 1387.7035 1404.1739 1425.3404 1454.3853 1458.0858 1469.5898 1480.7891 1487.9056 1598.8068 1610.5822 1624.3817 1663.2128 2970.5597 3007.5098 3031.1216 3046.2089 3099.8199 3100.9687 3134.9006 3139.9458 3167.4441 3167.5712 3184.0489 3187.4019 3499.3757 3532.3713
redmass: 7.4472 16.4629 12.0490 10.9943 6.1415 5.7730 9.0941 8.9271 1.2584 2.9746 6.3836 7.9990 6.6532 8.3092 10.4820 6.6860 5.9048 9.6611 9.0578 6.1876 5.4620 5.4858 3.7730 7.7649 3.6804 2.2701 2.9145 1.4416 5.2249 6.4101 4.5810 4.1773 3.5343 5.1046 6.9073 2.9423 7.0359 5.1160 5.6924 4.5542 1.8420 3.5687 4.6216 6.5968 6.9297 4.2751 4.6503 1.3648 1.7648 2.0552 5.6747 3.6335 1.5870 1.7391 1.5734 2.7019 3.3816 4.5128 1.6460 2.2819 3.3380 1.3594 2.8038 1.5680 1.3890 2.9385 1.0823 1.3634 1.3770 4.2737 1.2807 1.7517 1.4143 1.2890 1.6285 1.2196 1.4915 3.3097 2.5341 1.2333 5.7899 2.8766 1.0535 1.0566 1.0781 2.4629 1.9239 7.7755 6.3280 9.0136 10.3444 1.0842 1.0385 1.0601 1.0827 1.1077 1.0941 1.0907 1.1025 1.0893 1.0899 1.0945 1.0966 1.0771 1.0656
irintensity: 0.4097 0.2903 1.5074 0.0629 0.3003 2.0528 3.0044 1.0780 0.4375 0.0893 0.5855 2.0111 2.8576 3.3316 4.2052 4.1281 14.2327 3.9501 7.3045 7.9861 1.6434 14.3178 4.6850 2.5828 3.6328 63.9392 0.6418 85.5992 4.3505 5.2607 6.4432 10.8844 4.4691 24.7157 54.1331 2.6761 0.4599 18.1531 6.1502 44.4383 99.0828 84.6540 2.5959 56.4437 23.9491 10.4206 20.2719 22.0887 37.6786 25.6751 71.3819 3.3608 6.5169 17.4854 7.2058 20.3710 24.3533 96.5216 14.5837 12.0541 13.9305 7.4798 29.0102 40.3843 79.3480 355.5640 5.2605 22.4678 64.9460 310.4572 2.0047 2.6220 8.4967 2.1185 51.3050 5.1274 1.6491 50.9518 63.8991 58.4601 10.1933 31.1817 16.3164 19.6069 25.2180 40.9373 250.3008 1.8146 56.1111 222.6295 187.2709 27.4530 0.9708 6.6290 9.7014 14.0618 7.5451 9.3495 7.1424 0.3846 0.4814 0.9463 2.2099 43.4369 22.9362
temp: 298.150 k
press: 1.00000 atm
elementType: 17 17 8 8 8 8 8 8 7 7 6 6 6 6 6 6 6 6 6 6 6 6 6 1 1 1 1 1 1 1 1 1 1 1 1 1 1
symmnumber: 1
zpe: 692255.0 jmol-1
zpe.correction: 0.263666 hartree
zpe.thermalcorrener: 0.287506 hartree
zpe.thermalcorrenthalpy: 0.288451 hartree
zpe.thermalcorrgfe: 0.204302 hartree
zpe.sumelectzpe: -1982.959769 hartree
zpe.sumelectthermal: -1982.935929 hartree
zpe.sumelectthermalent: -1982.934985 hartree
zpe.sumelectthermalfe: -1983.019133 hartree
dipole: -6.2512 2.8526 -2.6050
dipole: 7.3485
quadrupole: -189.9515 -151.0252 -151.2241
quadrupole: -2.1704 -2.5369 -10.0642
quadrupole: -25.8846 13.0417 12.8428 -2.1704 -2.5369 -10.0642
hfenergy: -1983.2234354 hartree
pointgroup: C01 [X(C13H14Cl2N2O6)]
dipole: -2.3299066 1.0445931 -1.3560802 debye
polarizability: 261.2840065|1.5864988|200.9663274|27.0071872|-23.9297708|142.9981983 unknown
InChI: InChI=1S/C13H14Cl2N2O6/c1-7(18)23-6-10(16-13(20)12(14)15)11(19)8-2-4-9(5-3-8)17(21)22/h2-5,10-12,16,19H,6H2,1H3
charge 0 multiplicity 1
37 atoms
Cl -5.555113 0.434574 -0.413015
Cl -4.789648 -2.390422 -1.371984
O  -0.611348 -2.062876 -1.162563
O  -1.189507 2.140555 -0.629432
O  -3.06347 -1.755522 1.661053
O  -0.749642 4.099915 0.549042
O  6.102321 0.323701 0.296428
O  5.810742 -1.677482 1.351514
N  -2.540208 -0.269122 -0.077524
N  5.373888 -0.679421 0.659031
C  -1.118854 -0.100798 0.273515
C  -0.22624 -0.679154 -0.887223
C  -0.827581 1.366503 0.59741
C  1.245747 -0.689594 -0.507554
C  1.775209 -1.769576 0.243821
C  2.090855 0.386028 -0.87936
C  -3.387311 -1.083028 0.64085
C  3.128625 -1.773701 0.630843
C  3.447183 0.399669 -0.500355
C  3.944711 -0.683557 0.255596
C  -4.814653 -1.21571 0.092332
C  -1.123244 3.545594 -0.504182
C  -1.578782 4.222628 -1.775756
H  -0.940815 -0.709731 1.179328
H  -0.378901 -0.041696 -1.783592
H  0.235893 1.536285 0.833931
H  -1.44251 1.724579 1.440816
H  -2.93043 0.358161 -0.789393
H  1.122866 -2.612133 0.489858
H  1.689006 1.211729 -1.478219
H  -1.590306 -2.10044 -1.32299
H  3.561555 -2.595644 1.206932
H  4.119025 1.215661 -0.77819
H  -5.482121 -1.655701 0.840991
H  -2.649904 4.481852 -1.6875
H  -1.452805 3.566734 -2.650272
H  -1.018336 5.160043 -1.914488
