program: Gaussian 09
title: 000083948
version: EM64L-G09RevD.01
frameworkgroup: C1[X(C13H14Cl2N2O6)]
method: RPBEPBE
basis: SDD
operation: Freq
keyword: #p
keyword: freq=noraman
keyword: PBEPBE/SDD
title: #p freq=noraman PBEPBE/SDD
converged: YES YES NO NO
title: Mulliken charges:
elementType: Cl Cl O O O O O O N N C C C C C C C C C C C C C H H H H H H H H H H H H H H
charge: 0.025486 0.065010 -0.278913 -0.476294 -0.221347 -0.275030 -0.204655 -0.202983 -0.377915 0.028151 -0.075985 -0.233248 0.463790 -0.370591 -0.350703 -0.407602 0.380934 -0.360003 -0.363599 0.377974 0.323050 -0.718652 -0.754068 0.291533 0.305871 0.222756 0.246154 0.352816 0.273702 0.275988 0.288778 0.288423 0.365512 0.329107 0.262779 0.252212 0.251562
chargesum: 0.00000
title: Mulliken charges with hydrogens summed into heavy atoms:
elementType: Cl Cl O O O O O O N N C C C C C C C C C C C C C
charge: 0.025486 0.065010 -0.278913 -0.110782 -0.221347 -0.275030 -0.204655 -0.202983 -0.025099 0.028151 0.215549 0.072623 0.463790 0.098319 -0.077001 -0.131614 0.380934 -0.071225 -0.075176 0.377974 0.323050 -0.389545 0.012485
polarizability: 2.76140012e+02 -1.23364432e+01 1.65221436e+02 -7.24620352e+00 -1.87807653e+01 1.62739725e+02
1716.lowfreq: -8.5673 -7.1555 0.0017 0.0020 0.0025 4.0659 11.7583 19.5634 22.1686
frequency: 9.9731 19.3029 22.0226 26.2671 27.4890 49.3435 59.2847 66.2620 84.0273 86.9490 90.0856 106.0139 128.1905 146.3216 168.3477 193.8099 203.3964 224.8126 232.0661 257.9898 262.0184 282.7645 291.9457 305.2211 346.4999 371.5927 407.7595 431.2062 446.7328 482.5974 515.5810 525.5723 559.5502 569.9715 600.4678 619.0059 629.3186 651.8434 663.6891 671.2904 691.5424 723.6123 744.9342 754.9714 777.8640 830.3299 854.9823 862.6171 872.8499 885.3632 924.3135 942.7810 970.3943 990.5504 998.6340 1001.3325 1008.8674 1027.0780 1047.8739 1072.9339 1091.3147 1111.0487 1112.3166 1170.2846 1171.2708 1182.5015 1184.6837 1198.7880 1215.5389 1222.0091 1233.1971 1254.8387 1293.3858 1296.3285 1323.0024 1328.2508 1348.5507 1371.1581 1387.3942 1400.0983 1402.5381 1422.8278 1451.8224 1453.9612 1474.9701 1481.9444 1499.8109 1597.8708 1611.1479 1632.9544 1636.3945 2980.4560 3004.2940 3031.7535 3044.4322 3051.6876 3100.8320 3113.4979 3144.7205 3151.6657 3163.4264 3183.8140 3187.4082 3487.9015 3600.7103
redmass: 7.5782 14.0789 9.5182 5.7838 9.9609 2.9378 1.3591 5.8841 5.8471 4.4227 8.0105 6.4524 8.8630 8.1202 10.5116 7.8468 5.9690 11.1603 4.7844 5.6100 1.2379 7.0377 6.4796 4.8137 4.5486 5.7317 2.8910 4.2613 4.3532 5.7687 5.3578 3.1116 2.5759 4.0528 8.2646 1.9608 4.6752 4.6919 6.0854 5.0316 5.3909 6.1540 4.5942 8.2954 8.3136 4.5077 1.5017 2.3569 2.1868 3.5166 3.3097 5.5368 3.2223 1.3604 1.3784 1.9297 3.0086 4.2919 1.6455 2.3255 3.2922 1.5751 1.8283 1.3340 1.2114 1.3158 1.2903 3.0071 2.1236 4.9046 1.1845 1.3522 1.5775 1.6953 1.3879 1.4301 1.5306 5.5581 1.2353 1.3848 6.6560 3.0624 1.0572 1.0575 1.0938 2.3757 1.6773 7.8200 6.1915 7.5620 9.7104 1.0571 1.0397 1.0844 1.1074 1.0851 1.0922 1.0893 1.1028 1.0909 1.0897 1.0949 1.0964 1.0795 1.0670
irintensity: 6.1817 0.1133 0.9853 2.3399 1.3626 0.7952 0.3984 0.7344 0.1805 4.8736 7.5529 0.6138 1.9702 4.8918 3.4793 5.9297 4.1553 2.7438 11.9834 12.4711 125.0113 3.8828 12.2778 3.0064 11.5038 12.8907 0.3579 5.4057 2.3166 2.7590 4.5188 6.3071 102.4566 28.8477 37.4448 53.3866 18.4033 92.3291 5.5301 27.8683 36.3212 7.7854 1.5850 55.9316 32.9733 13.1841 3.0291 10.2821 60.3005 22.0286 14.5193 71.1274 49.3593 2.3508 0.7521 80.6271 2.4943 49.0000 13.5274 19.4127 15.1620 4.4447 17.3464 15.8031 11.3075 37.8501 31.1582 496.4836 30.3569 197.6462 33.1048 27.3334 15.6532 16.4882 1.4270 13.8314 8.5882 107.1270 67.3354 1.4504 4.7807 29.1709 20.7482 14.2966 13.5401 14.8668 255.7646 6.4494 44.4360 99.7665 220.9267 36.1899 0.8389 10.1714 50.1318 0.9722 4.2695 5.0794 5.5065 1.4503 1.2748 0.5105 3.0055 82.0133 12.3439
temp: 298.150 k
press: 1.00000 atm
elementType: 17 17 8 8 8 8 8 8 7 7 6 6 6 6 6 6 6 6 6 6 6 6 6 1 1 1 1 1 1 1 1 1 1 1 1 1 1
symmnumber: 1
zpe: 691616.3 jmol-1
zpe.correction: 0.263423 hartree
zpe.thermalcorrener: 0.287476 hartree
zpe.thermalcorrenthalpy: 0.288420 hartree
zpe.thermalcorrgfe: 0.203497 hartree
zpe.sumelectzpe: -1982.954937 hartree
zpe.sumelectthermal: -1982.930883 hartree
zpe.sumelectthermalent: -1982.929939 hartree
zpe.sumelectthermalfe: -1983.014862 hartree
dipole: -1.5370 -0.1834 3.5291
dipole: 3.8537
quadrupole: -205.7079 -129.8738 -154.1828
quadrupole: -3.7114 -1.1439 -11.0949
quadrupole: -42.4531 33.3810 9.0720 -3.7114 -1.1439 -11.0949
hfenergy: -1983.2183593 hartree
pointgroup: C01 [X(C13H14Cl2N2O6)]
dipole: 0.5576784 -0.3752396 1.3590106 debye
polarizability: 268.6643776|-32.1573022|163.4116299|6.1340695|16.2860081|172.0251656 unknown
InChI: InChI=1S/C13H14Cl2N2O6/c1-7(19)23-11(10(6-18)16-13(20)12(14)15)8-2-4-9(5-3-8)17(21)22/h2-5,10-12,16,18H,6H2,1H3
charge 0 multiplicity 1
37 atoms
Cl 4.944259 -1.859136 -1.154006
Cl 6.287771 0.722995 -0.193593
O  0.363937 -1.655041 -0.235227
O  0.773645 1.630411 2.38426
O  3.423407 1.162386 -1.413926
O  1.728342 -2.478232 1.473365
O  -6.077276 1.689449 0.312659
O  -5.767028 1.115226 -1.873001
N  2.476356 0.148989 0.460919
N  -5.356533 1.228377 -0.654367
C  1.124259 0.66623 0.195119
C  0.075126 -0.423861 0.567151
C  -1.348085 -0.008659 0.240182
C  0.862853 1.979308 0.954958
C  -1.843885 -0.105021 -1.085586
C  -2.182951 0.498746 1.267517
C  3.516528 0.408479 -0.406895
C  -3.158115 0.29901 -1.387324
C  -3.499933 0.908731 0.982536
C  -3.967088 0.802466 -0.345086
C  1.193967 -2.625556 0.347262
C  4.800437 -0.356806 -0.031596
C  1.371343 -3.803116 -0.576475
H  1.068804 0.887665 -0.887349
H  0.177966 -0.667848 1.639675
H  -0.082758 2.438055 0.60393
H  1.702015 2.672705 0.755322
H  2.591283 -0.468871 1.271615
H  -1.204311 -0.518516 -1.870853
H  -1.790404 0.579134 2.286549
H  -3.565831 0.230696 -2.399153
H  -4.164869 1.298609 1.757446
H  0.866983 2.44352 2.937449
H  4.804278 -0.758187 0.990506
H  2.220617 -3.595263 -1.254154
H  0.473645 -3.969261 -1.190654
H  1.613445 -4.701512 0.010723
