program: Gaussian 09
title: 000084016
version: EM64L-G09RevD.01
frameworkgroup: C1[X(C19H25Cl2N3O6)]
method: RPBEPBE
basis: SDD
operation: Freq
keyword: #p
keyword: freq=noraman
keyword: PBEPBE/SDD
title: #p freq=noraman PBEPBE/SDD
converged: YES YES NO NO
title: Mulliken charges:
elementType: Cl Cl O O O O O O N N N C C C C C C C C C C C C C C C C C C C H H H H H H H H H H H H H H H H H H H H H H H H H
charge: 0.074765 0.052796 -0.215538 -0.442102 -0.285167 -0.220380 -0.209271 -0.205004 -0.075201 -0.405177 0.027753 -0.371830 -0.351812 -0.386566 -0.396624 -0.398320 -0.374394 -0.499429 -0.119721 -0.332697 -0.368184 0.295364 0.633431 -0.453175 -0.365707 0.408597 -0.355372 -0.361938 0.381077 -0.733322 0.173684 0.226449 0.201501 0.178537 0.195692 0.203045 0.204934 0.193022 0.190520 0.215234 0.201011 0.269759 0.255332 0.234800 0.300796 0.226824 0.240274 0.270854 0.308606 0.236904 0.256391 0.377740 0.286460 0.286891 0.317891
chargesum: 0.00000
title: Mulliken charges with hydrogens summed into heavy atoms:
elementType: Cl Cl O O O O O O N N N C C C C C C C C C C C C C C C C C C C
charge: 0.074765 0.052796 -0.215538 -0.064362 -0.285167 -0.220380 -0.209271 -0.205004 -0.075201 -0.096571 0.027753 0.028302 0.028227 0.012171 0.001332 0.007433 0.096376 -0.009296 0.181075 -0.105874 0.142944 0.295364 0.633431 -0.216271 -0.109316 0.408597 -0.068913 -0.075047 0.381077 -0.415432
polarizability: 3.26856220e+02 1.14067388e+01 2.31717569e+02 4.64487876e+00 1.90232500e+01 2.53478437e+02
1716.lowfreq: -6.7662 -5.2896 0.0009 0.0015 0.0017 3.4902 6.0172 9.1650 11.6217
frequency: 5.8398 8.2025 11.5774 15.5898 18.2266 20.9954 31.1241 36.1720 47.6595 55.5346 64.6944 71.3239 95.5547 112.2115 124.5934 143.7265 149.7876 161.7310 180.8693 196.5126 204.9783 227.2546 230.6270 236.6691 255.4570 277.7809 278.8481 298.7530 312.6729 342.2041 348.5792 360.9466 380.3980 396.7633 407.1065 434.6725 440.0001 448.0844 451.8343 479.8672 501.3133 527.8429 532.2892 544.4138 556.6499 599.4584 623.4691 634.1957 654.9239 662.8693 671.3357 687.3625 696.1507 736.2298 746.0938 753.0200 758.2907 769.5897 780.9119 801.9609 824.8609 837.9654 848.9096 849.8111 856.5902 860.0229 904.6362 906.9921 936.0318 955.8649 961.6767 984.2348 987.5500 992.1114 999.1253 1002.8893 1008.6643 1023.7435 1035.2123 1047.2665 1069.6214 1076.9861 1092.7832 1101.4008 1111.8135 1119.5258 1121.0052 1145.9150 1153.2121 1161.6031 1166.6680 1179.6784 1189.1894 1202.6336 1212.6449 1215.2820 1222.3040 1252.0880 1258.9036 1261.6459 1266.4236 1269.1917 1273.6000 1289.4677 1291.6308 1302.8138 1314.3603 1328.2532 1330.4329 1341.5036 1341.8381 1345.5896 1349.7847 1369.7228 1371.0876 1380.3791 1392.8563 1406.0525 1410.7656 1425.9624 1448.6995 1451.5594 1453.4099 1461.1002 1463.9886 1465.4438 1475.1192 1478.9242 1479.7805 1488.9940 1597.1151 1600.7583 1609.7054 1634.1131 2828.9629 2842.5991 2878.6038 2958.3065 2966.9849 2985.3965 2987.1466 3023.9547 3030.4977 3032.0009 3035.6875 3036.5164 3037.6429 3046.6673 3047.4244 3055.8246 3102.3924 3120.4616 3123.8081 3124.1032 3148.6674 3182.4422 3185.0696 3277.7309 3533.3748
redmass: 8.0103 3.7538 11.5153 7.6488 5.2672 7.0273 5.8542 11.4444 6.4699 3.5884 7.5189 6.6539 3.4796 9.3388 8.2312 7.6802 7.9951 7.9008 4.4650 7.7090 3.5838 6.3512 1.9566 6.6517 7.1960 4.6094 5.2491 4.4390 3.2781 4.5135 3.7498 2.9026 2.1855 3.6661 2.8960 3.8560 3.5051 2.8869 3.7168 4.3593 5.8961 1.6778 3.5073 1.8317 2.3620 7.0291 5.5297 1.5719 4.0232 4.5746 4.3650 6.1404 4.3774 6.0727 4.3238 5.9194 4.3020 5.7519 1.8034 1.5167 3.9754 2.9030 1.2695 1.5157 2.4210 1.6946 2.6297 2.7964 3.6651 1.3133 6.1615 1.4054 3.1945 1.3912 4.4646 3.1597 3.3790 2.3597 3.1506 2.0966 1.8132 2.7917 3.2218 1.9616 1.3205 2.7059 2.6374 1.4246 1.4861 2.3229 1.7044 1.2967 1.1341 2.7053 1.4453 1.4570 5.9184 1.5708 1.1882 1.3257 1.2179 1.3705 1.6108 1.3241 1.2775 1.3957 1.2192 1.5386 1.2689 1.3630 1.3831 1.4069 1.4735 4.5878 1.4371 1.2608 1.3123 6.2871 1.2031 2.9416 1.1265 1.0917 1.1278 1.0871 1.0895 1.0856 1.0934 1.6497 2.4091 1.0989 8.7064 7.6249 6.3562 7.9651 1.0712 1.0705 1.0698 1.0847 1.0630 1.0615 1.0613 1.0868 1.0682 1.0919 1.0705 1.0762 1.0882 1.1014 1.0844 1.1037 1.0888 1.1042 1.1040 1.0915 1.0904 1.0942 1.0954 1.0701 1.0779
irintensity: 0.1388 0.2199 0.2768 0.4421 0.8070 0.2667 0.3670 1.4925 2.6872 1.2280 0.7877 2.4354 0.4697 1.8209 2.4445 9.2482 0.8180 14.9677 2.0745 2.5034 1.3438 3.8737 0.8276 4.5672 8.2439 3.7784 1.3866 0.4627 1.7085 5.4311 8.6360 7.3035 5.1303 19.7838 0.3202 4.2429 1.0246 0.6920 8.0849 13.2402 9.6159 73.6875 16.8459 0.6612 46.9370 32.5256 16.4114 154.0891 73.1321 16.5574 34.8310 29.4166 11.1226 14.6739 2.0158 38.9189 19.0463 49.0502 1.7459 0.6956 3.3164 8.8327 1.5963 7.2047 7.5078 64.3453 1.4288 6.7432 3.4640 4.0185 68.4420 2.4214 3.2905 0.3247 40.6379 70.0628 14.3722 44.1724 12.5416 10.1836 62.1533 10.0703 14.1085 74.0200 10.3668 4.6803 2.5853 45.8113 33.4445 35.7518 48.3955 61.1422 12.8441 42.1019 76.8860 48.1408 244.7154 30.2169 17.4588 45.7106 12.3878 39.2093 14.5605 2.6047 23.6032 53.8540 4.8434 6.0831 7.6442 11.6349 18.3600 16.1148 1.2909 80.5381 18.5431 7.8926 3.7035 4.9460 69.8405 38.0766 62.0203 8.6050 19.5164 13.9029 9.6672 4.2949 2.6272 129.0041 4.2984 20.2815 177.6272 25.5104 34.3123 161.0316 59.0962 96.0084 84.6400 43.0398 37.9373 34.8360 31.4642 61.2163 14.8850 65.3392 6.7245 11.0397 21.9904 28.6181 4.5764 91.3076 6.9306 6.9956 3.5133 15.3303 4.2848 0.3310 3.4074 581.5002 19.1411
temp: 298.150 k
press: 1.00000 atm
elementType: 17 17 8 8 8 8 8 8 7 7 7 6 6 6 6 6 6 6 6 6 6 6 6 6 6 6 6 6 6 6 1 1 1 1 1 1 1 1 1 1 1 1 1 1 1 1 1 1 1 1 1 1 1 1 1
symmnumber: 1
zpe: 1125958.4 jmol-1
zpe.correction: 0.428855 hartree
zpe.thermalcorrener: 0.459344 hartree
zpe.thermalcorrenthalpy: 0.460289 hartree
zpe.thermalcorrgfe: 0.357617 hartree
zpe.sumelectzpe: -2272.364974 hartree
zpe.sumelectthermal: -2272.334485 hartree
zpe.sumelectthermalent: -2272.333540 hartree
zpe.sumelectthermalfe: -2272.436212 hartree
dipole: -3.5665 -0.9585 -6.3054
dipole: 7.3073
quadrupole: -208.0998 -209.2579 -184.7670
quadrupole: -0.0840 -35.9867 -2.9109
quadrupole: -7.3916 -8.5497 15.9413 -0.0840 -35.9867 -2.9109
hfenergy: -2272.793829 hartree
pointgroup: C01 [X(C19H25Cl2N3O6)]
dipole: -1.4290074 -1.7270406 -1.8001235 debye
polarizability: 324.6512742|16.8179104|256.7934154|-9.0322673|16.680705|230.6075359 unknown
InChI: InChI=1S/C19H25Cl2N3O6/c20-18(21)19(27)22-15(17(26)13-4-6-14(7-5-13)24(28)29)12-30-16(25)8-11-23-9-2-1-3-10-23/h4-7,15,17-18,22,26H,1-3,8-12H2
charge 0 multiplicity 1
55 atoms
Cl -0.370041 2.608031 -4.037499
Cl 2.271584 2.574575 -2.476209
O  -1.745909 -2.426202 -1.452265
O  1.456342 -3.1645 0.567943
O  -1.315085 -2.725805 0.815926
O  -0.602647 0.914472 -1.459854
O  6.503211 2.155195 0.817037
O  5.057205 2.569279 2.531835
N  -4.757252 0.269999 0.532664
N  0.961976 -0.644429 -2.209978
N  5.414067 1.923729 1.472217
C  -4.757763 1.728711 0.237553
C  -5.473061 -0.039523 1.796194
C  -6.198848 2.266394 0.134699
C  -6.934067 0.453047 1.744171
C  -6.990149 1.96469 1.427656
C  -3.413653 -0.33007 0.461647
C  -3.500079 -1.849386 0.08244
C  0.619647 -1.637284 -1.179812
C  1.881377 -2.260522 -0.495067
C  -0.316345 -2.755569 -1.716778
C  -2.114558 -2.400301 -0.107053
C  2.820681 -1.178716 0.034042
C  4.038827 -0.896021 -0.631328
C  2.474792 -0.437749 1.192917
C  0.337323 0.593357 -2.233609
C  4.897848 0.120981 -0.170418
C  3.317411 0.581731 1.670694
C  4.5179 0.850312 0.975363
C  0.933737 1.541442 -3.291607
H  -4.21018 2.302396 1.030714
H  -4.219238 1.889021 -0.714275
H  -5.454407 -1.132869 1.961638
H  -4.955434 0.434793 2.672309
H  -6.169238 3.355435 -0.06115
H  -6.698361 1.782891 -0.727077
H  -7.472392 -0.110231 0.957537
H  -7.428416 0.237083 2.710952
H  -6.546634 2.533821 2.271197
H  -8.03952 2.300898 1.328344
H  -2.847332 -0.235062 1.420855
H  -2.829225 0.193282 -0.316803
H  -4.082468 -1.940549 -0.846885
H  -3.998653 -2.410895 0.890559
H  0.076594 -1.066274 -0.404783
H  2.432111 -2.883682 -1.232135
H  -0.268496 -2.832705 -2.812987
H  -0.077959 -3.726225 -1.247748
H  1.737333 -0.839927 -2.847449
H  4.332054 -1.489769 -1.505969
H  1.552747 -0.675074 1.733867
H  0.493531 -3.004992 0.812435
H  5.843025 0.354036 -0.667292
H  3.069805 1.167355 2.559792
H  1.430184 1.021378 -4.122467
