program: Gaussian 09
title: 000083827
version: EM64L-G09RevD.01
frameworkgroup: C1[X(C18H23NO3)]
method: RPBEPBE
basis: SDD
operation: Freq
keyword: #p
keyword: freq=noraman
keyword: PBEPBE/SDD
title: #p freq=noraman PBEPBE/SDD
converged: YES YES NO NO
title: Mulliken charges:
elementType: O O O N C C C C C C C C C C C C C C C C C C H H H H H H H H H H H H H H H H H H H H H H H
charge: -0.282732 -0.256864 -0.234030 -0.072631 -0.200961 -0.131231 -0.277101 0.005863 -0.502190 -0.506767 -0.487335 -0.647433 -0.650532 0.246224 0.131521 0.282626 -0.507981 -0.335789 -0.352552 -0.253108 -0.231120 -0.223920 0.276272 0.225973 0.302033 0.233887 0.187443 0.232349 0.234959 0.233719 0.229905 0.215539 0.232759 0.290540 0.224197 0.195556 0.236195 0.242048 0.222627 0.246545 0.251668 0.277658 0.229883 0.233193 0.233093
chargesum: 0.00000
title: Mulliken charges with hydrogens summed into heavy atoms:
elementType: O O O N C C C C C C C C C C C C C C C C C C
charge: -0.282732 -0.256864 -0.234030 -0.072631 0.075311 0.094742 0.024933 0.239750 -0.082398 -0.038088 -0.041891 -0.124134 0.005416 0.246224 0.131521 0.282626 0.203239 -0.084121 -0.074895 -0.023225 0.002073 0.009173
polarizability: 2.59398273e+02 1.52827079e+01 1.70627287e+02 3.01469233e+00 1.91453898e+01 1.75423418e+02
1716.lowfreq: -10.5670 -8.8084 -2.2382 -0.0007 -0.0006 -0.0003 20.2575 27.9038 43.3211
frequency: 20.0586 27.8227 43.2366 50.6308 70.1710 80.5756 107.6938 113.3941 142.3359 148.4411 163.5103 175.0976 202.3523 214.7455 238.3520 247.3692 275.0330 281.7290 311.0991 333.6909 363.9233 386.7814 400.1806 413.5686 418.5141 478.4461 498.9723 522.5402 577.4266 592.0537 613.3491 615.8071 650.2899 697.5084 698.4790 723.3236 747.2456 757.7388 768.2624 775.7821 791.5963 815.8649 845.2605 848.3566 860.4820 908.5192 925.4867 942.9289 953.8789 966.0936 973.9096 979.8257 990.0811 991.7715 995.3816 1010.8640 1017.8867 1028.6192 1037.0718 1053.3437 1084.0913 1097.9130 1104.9975 1110.8562 1121.3346 1127.9522 1135.2246 1145.1791 1157.2233 1161.8513 1172.9267 1188.2525 1195.6151 1210.0500 1218.5692 1224.5601 1231.6102 1242.5341 1260.5489 1275.1163 1281.5607 1292.2497 1304.6752 1314.8320 1321.4616 1335.7611 1348.4419 1356.0036 1370.8521 1386.9922 1417.8712 1426.5716 1431.5165 1436.6904 1450.2565 1453.4686 1463.9472 1464.9156 1469.1223 1479.3760 1482.8934 1488.3052 1566.3034 1596.9773 1611.6722 1623.7551 2883.5004 2958.5789 2979.0409 2990.1526 3003.2756 3004.2898 3015.3124 3016.5831 3024.6352 3037.2466 3040.0686 3054.9868 3058.6962 3065.5594 3080.5624 3081.2217 3107.9233 3128.0738 3138.6945 3142.9171 3150.6645 3159.5086 3169.3646
redmass: 5.2793 4.5007 4.1087 4.7879 4.4554 4.1283 1.2344 3.1381 4.9860 4.9538 3.5761 3.5812 1.1039 2.1518 3.0038 3.3371 4.0456 2.5622 4.8959 3.3208 2.7009 3.2219 2.8205 3.1276 5.7597 4.0043 4.2730 3.2893 3.1978 3.2388 6.1286 3.6324 6.2991 1.8679 4.0221 4.3294 4.6102 4.8094 1.8469 3.5965 1.8663 3.3369 2.3213 2.4670 1.2569 2.5296 2.2783 3.0243 1.8138 2.1625 2.8144 3.4420 6.0410 1.3858 2.4461 1.3524 2.2410 1.9508 2.4403 1.8928 1.5926 1.8476 1.6722 1.2722 1.5376 2.3086 1.8175 1.4553 1.4549 1.9318 1.0715 1.1392 1.5532 1.5162 1.3764 1.9721 1.6979 1.6703 1.4356 1.4511 1.6143 1.3281 1.3835 1.3686 1.5700 1.5980 1.5254 1.4656 1.3607 9.2056 1.1794 1.1704 1.2959 1.7495 1.0508 1.0943 1.0528 1.0530 1.0705 2.1918 1.0526 1.0901 6.7010 6.7054 6.3264 9.9083 1.0533 1.0665 1.0642 1.0802 1.0594 1.0290 1.0821 1.0634 1.0758 1.0867 1.0907 1.1017 1.0988 1.0906 1.1020 1.1024 1.1045 1.0851 1.0882 1.1051 1.0923 1.0958 1.1011
irintensity: 0.5075 0.4688 0.0787 3.4548 1.9894 1.8266 0.1821 0.3309 0.2564 0.4772 2.8455 1.2114 0.2851 0.7107 3.1494 3.6529 14.6282 1.1251 6.4523 6.9850 0.7220 10.0963 0.0639 1.2148 1.6212 6.7318 12.6996 2.3809 5.4657 7.2710 0.2531 10.6424 14.0236 42.1223 16.6443 13.9537 16.2853 7.1394 44.7211 8.5669 4.8356 11.6728 1.0602 8.4630 0.7684 1.9805 2.9162 45.6082 2.2179 4.7869 19.0102 46.3613 3.7838 0.4386 18.4548 0.7518 1.3884 3.6221 1.8663 19.1988 9.7852 5.8343 4.2226 0.0455 57.1168 45.4945 10.4171 20.1593 2.3878 63.0881 3.7559 27.4686 39.0142 0.5863 34.0966 31.1618 91.0938 10.9099 1.5449 40.9263 106.6526 1.3415 6.8478 0.3489 1.6634 22.9258 25.3148 1.8465 8.2069 3.1325 17.7053 4.0035 13.5581 23.5081 12.9383 13.3003 10.2953 10.7555 13.4741 1.4490 2.4536 29.6236 93.1571 28.4926 7.4428 173.2216 119.5849 42.2931 42.3887 18.1806 20.7252 34.9722 3.1922 37.7017 46.5734 60.1595 19.3960 11.1991 18.3358 5.3841 43.6804 57.9862 23.5311 0.0604 7.7231 15.4710 16.4088 23.2243 21.2046
temp: 298.150 k
press: 1.00000 atm
elementType: 8 8 8 7 6 6 6 6 6 6 6 6 6 6 6 6 6 6 6 6 6 6 1 1 1 1 1 1 1 1 1 1 1 1 1 1 1 1 1 1 1 1 1 1 1
symmnumber: 1
zpe: 985833.5 jmol-1
zpe.correction: 0.375484 hartree
zpe.thermalcorrener: 0.396283 hartree
zpe.thermalcorrenthalpy: 0.397227 hartree
zpe.thermalcorrgfe: 0.324494 hartree
zpe.sumelectzpe: -978.474333 hartree
zpe.sumelectthermal: -978.453534 hartree
zpe.sumelectthermalent: -978.452590 hartree
zpe.sumelectthermalfe: -978.525323 hartree
dipole: 1.3227 0.3963 3.6078
dipole: 3.8630
quadrupole: -108.4296 -129.1130 -132.7120
quadrupole: 8.1847 -0.9165 5.9900
quadrupole: 14.9886 -5.6948 -9.2938 8.1847 -0.9165 5.9900
hfenergy: -978.8498167 hartree
pointgroup: C01 [X(C18H23N1O3)]
dipole: -0.4756826 -0.073427 -1.441582 debye
polarizability: 260.6432936|-7.1268224|163.9821369|8.6152972|-17.6160256|180.8235476 unknown
InChI: InChI=1S/C18H23NO3/c1-19-14-8-9-15(19)17(18(21)22-2)13(10-14)11-16(20)12-6-4-3-5-7-12/h3-7,13-15,17H,8-11H2,1-2H3
charge 0 multiplicity 1
45 atoms
O  0.760492 2.236067 -0.565072
O  1.604393 2.62765 1.556399
O  -1.177273 -1.348955 1.395533
N  3.674528 0.467605 -0.18304
C  2.960034 0.050735 1.066427
C  3.389332 -0.693864 -1.089129
C  1.434053 0.295544 0.812379
C  0.944592 -0.627557 -0.343577
C  1.915386 -0.574022 -1.553667
C  3.298715 -1.470217 1.254158
C  3.61653 -1.96986 -0.196056
C  -0.524737 -0.424977 -0.768679
C  5.115882 0.742323 0.017185
C  1.284206 1.8096 0.662228
C  -1.544489 -0.826742 0.298626
C  -3.007471 -0.607199 0.020093
C  0.69765 3.707341 -0.744376
C  -3.478004 -0.055413 -1.202528
C  -3.949194 -0.972497 1.020676
C  -4.86096 0.124458 -1.418735
C  -5.329192 -0.790004 0.806079
C  -5.789247 -0.241212 -0.415934
H  3.281894 0.673622 1.916918
H  4.063232 -0.661421 -1.963834
H  0.882717 0.023299 1.73327
H  0.99479 -1.648938 0.084373
H  1.676162 -1.398858 -2.255074
H  1.796339 0.383352 -2.092283
H  2.465819 -2.024312 1.721314
H  4.177084 -1.581575 1.914372
H  4.66109 -2.320039 -0.275383
H  2.964078 -2.805407 -0.506486
H  -0.727152 -1.039837 -1.672413
H  -0.692859 0.624525 -1.072041
H  5.56718 1.026888 -0.950201
H  5.702016 -0.11349 0.430992
H  5.225896 1.597019 0.707674
H  0.058404 4.163043 0.030262
H  0.27275 3.851237 -1.748255
H  1.710766 4.136945 -0.675298
H  -2.770414 0.234377 -1.985943
H  -3.566789 -1.396156 1.955385
H  -5.216099 0.549012 -2.36417
H  -6.046938 -1.072339 1.584024
H  -6.862694 -0.099252 -0.584696
