program: Gaussian 09
title: 000083755
version: EM64L-G09RevD.01
frameworkgroup: C1[X(C8H18O3)]
method: RPBEPBE
basis: SDD
operation: Freq
keyword: #pfreq=noraman
keyword: PBEPBE/SDD
title: #p freq=noraman PBEPBE/SDD
converged: YES YES NO NO
title: Mulliken charges:
elementType: O O O C C C C C C C C H H H H H H H H H H H H H H H H H H
charge: -0.289607 -0.252580 -0.252512 -0.495373 -0.323051 0.314255 -0.340630 -0.695739 -0.523873 -0.545735 -0.545544 0.229473 0.229340 0.206763 0.207014 0.191736 0.191759 0.215159 0.212136 0.212165 0.234491 0.222874 0.234036 0.232770 0.213077 0.235917 0.235872 0.213017 0.232789
chargesum: 0.00000
title: Mulliken charges with hydrogens summed into heavy atoms:
elementType: O O O C C C C C C C C
charge: -0.289607 -0.252580 -0.252512 -0.036560 0.090725 0.314255 0.042865 -0.056278 0.167529 0.136029 0.136133
polarizability: 1.11898220e+02 1.02461275e-02 1.00176946e+02 -2.04197779e+00 3.44750050e-03 8.16198275e+01
1716.lowfreq: -70.9001 -0.0009 -0.0008 -0.0005 11.9227 15.6604 23.6016 51.5686 70.7376
frequency: -70.6449 51.5639 70.5343 95.3186 130.7747 131.5782 149.1367 154.9147 171.6055 212.1351 215.6746 222.6476 260.9359 287.0930 325.8107 331.9335 369.0975 433.7916 467.6515 555.4545 617.1119 727.3735 735.5014 784.5988 862.3434 867.3108 923.6098 946.5202 972.6516 999.5967 1028.3236 1038.3401 1082.3473 1114.3308 1114.5770 1117.1323 1119.0577 1129.0013 1144.3998 1157.9271 1174.4251 1203.1564 1220.6363 1270.2828 1281.7050 1293.4214 1339.3464 1365.9352 1391.6500 1419.1622 1430.0186 1434.6522 1446.0245 1457.7200 1464.9948 1468.3058 1473.0478 1476.2548 1480.1680 1482.3497 1487.7510 1489.8193 1501.2508 2961.1745 2962.4729 2963.2806 2975.3201 2985.8038 2991.3677 3004.6477 3013.2152 3039.7051 3048.4310 3050.0589 3066.2356 3073.8822 3074.0460 3078.8366 3113.0115 3113.1723 3121.7524
redmass: 1.0554 2.5107 1.7169 3.4594 2.6678 2.5758 2.4290 1.4626 1.4630 1.7221 2.0339 1.1053 3.4944 3.5837 3.5989 2.7121 3.6046 4.1471 3.6116 4.2108 5.0748 4.6311 1.0816 1.3934 1.8570 3.0456 2.4814 1.7969 7.9738 2.7134 5.5273 5.1064 2.4189 1.4916 1.2588 2.3595 1.2544 1.3915 1.4216 1.4470 1.9818 3.2310 1.4544 1.3235 1.1694 1.0815 1.4785 1.6192 1.2228 1.1257 1.1300 1.1375 1.0558 1.0628 1.0592 1.0635 1.0565 1.0420 1.0638 1.0492 1.0606 1.0733 1.0737 1.0327 1.0591 1.0328 1.0362 1.0297 1.0600 1.0997 1.0600 1.1009 1.1019 1.1020 1.1017 1.1007 1.0997 1.1034 1.1004 1.1003 1.1036
irintensity: 0.0007 0.0015 0.0005 0.6178 8.8173 0.0824 1.4006 3.2834 1.2669 2.7668 7.9807 0.0516 17.8604 7.5971 9.1173 10.3300 3.7054 0.1029 4.5022 0.9361 4.3912 7.1365 4.0205 11.6127 10.1099 65.9277 34.7243 7.8229 149.9337 244.5449 20.7711 2.1380 4.3385 24.0678 0.1178 18.8818 3.0307 19.9785 41.6093 3.4188 39.6223 38.4085 46.2772 25.2318 12.3858 10.5844 16.9184 1.9328 14.7483 12.5695 13.1960 0.0821 3.7032 6.3705 0.2021 13.0802 9.5740 13.3678 4.6738 8.6455 13.3428 8.9374 10.6466 91.1778 33.7458 21.7899 34.6133 49.7074 22.1548 9.1701 29.8416 4.4657 1.6237 99.7199 4.0278 98.9738 61.6182 52.6957 10.8672 34.5518 22.2771
temp: 298.150 k
press: 1.00000 atm
elementType: 8 8 8 6 6 6 6 6 6 6 6 1 1 1 1 1 1 1 1 1 1 1 1 1 1 1 1 1 1
symmnumber: 1
zpe: 662780.2 jmol-1
zpe.correction: 0.252440 hartree
zpe.thermalcorrener: 0.266388 hartree
zpe.thermalcorrenthalpy: 0.267332 hartree
zpe.thermalcorrgfe: 0.212268 hartree
zpe.sumelectzpe: -540.337489 hartree
zpe.sumelectthermal: -540.323541 hartree
zpe.sumelectthermalent: -540.322596 hartree
zpe.sumelectthermalfe: -540.377661 hartree
dipole: 0.0677 -0.0034 1.6396
dipole: 1.6410
quadrupole: -64.5939 -59.4028 -76.3475
quadrupole: 0.0155 -0.6551 0.0061
quadrupole: 2.1875 7.3786 -9.5661 0.0155 -0.6551 0.0061
hfenergy: -540.5899285 hartree
pointgroup: C01 [X(C8H18O3)]
dipole: -0.0271351 0.0045442 0.6450441 debye
polarizability: 111.8937421|0.1346072|100.177883|2.0646918|-0.0829723|81.6233679 unknown
InChI: InChI=1S/C8H18O3/c1-5-6-7-8(9-2,10-3)11-4/h5-7H2,1-4H3
charge 0 multiplicity 1
29 atoms
O  1.883817 0.025684 0.994324
O  0.951032 1.123492 -0.937378
O  0.972844 -1.112159 -0.92464
C  -0.500584 0.001259 0.775652
C  -1.74602 -0.016203 -0.134534
C  0.821123 0.009566 -0.012779
C  -3.063123 -0.021188 0.672987
C  -4.315262 -0.03884 -0.229772
C  3.248871 0.03842 0.428051
C  0.8493 2.448277 -0.309349
C  0.893414 -2.431402 -0.281926
H  -0.501142 -0.877974 1.446055
H  -0.518139 0.888408 1.435382
H  -1.708825 -0.903638 -0.796456
H  -1.723235 0.861631 -0.809775
H  -3.093675 0.87077 1.332322
H  -3.078453 -0.903101 1.34619
H  -5.245798 -0.042022 0.366894
H  -4.323919 -0.936216 -0.876515
H  -4.33886 0.848048 -0.890411
H  3.427678 -0.856696 -0.193773
H  3.919997 0.044324 1.300463
H  3.411463 0.937303 -0.192874
H  1.499555 2.525669 0.582507
H  -0.194387 2.685746 -0.0240
H  1.182114 3.157499 -1.082619
H  1.238963 -3.143362 -1.04704
H  -0.146269 -2.683571 0.0054
H  1.54412 -2.487823 0.611213
