program: Gaussian 09
title: 000083697
version: EM64L-G09RevD.01
frameworkgroup: C1[X(C6H12O3)]
method: RPBEPBE
basis: SDD
operation: Freq
keyword: #pfreq=noraman
keyword: PBEPBE/SDD
title: #p freq=noraman PBEPBE/SDD
converged: YES YES NO NO
title: Mulliken charges:
elementType: O O O C C C C C C H H H H H H H H H H H H
charge: -0.454568 -0.403935 -0.244289 -0.006124 -0.419972 -0.132079 -0.705574 -0.736206 0.132603 0.198096 0.227961 0.212392 0.261156 0.200587 0.199974 0.261141 0.230332 0.217388 0.212471 0.360356 0.388290
chargesum: 0.00000
title: Mulliken charges with hydrogens summed into heavy atoms:
elementType: O O O C C C C C C
charge: -0.094212 -0.015644 -0.244289 0.191972 0.020381 0.129077 -0.043873 -0.076014 0.132603
polarizability: 8.96370870e+01 4.24545803e-01 7.65136948e+01 -2.88128385e+00 -1.11627611e+00 5.94076255e+01
1716.lowfreq: -15.0832 -9.8563 -0.0005 0.0009 0.0010 8.7375 24.9627 43.0669 109.3866
frequency: 24.8812 43.0008 109.3717 151.5165 210.2628 219.5792 249.3539 279.1745 322.6980 328.4999 362.8588 381.7248 457.7519 538.5096 574.6463 617.8664 675.9936 791.5062 822.7632 883.1143 918.2493 950.5091 966.0455 991.8524 1021.2606 1066.3755 1116.1942 1132.5061 1195.8380 1221.0512 1229.5263 1286.5304 1299.1750 1310.8832 1337.4091 1354.2297 1379.5386 1389.1358 1396.2129 1445.9510 1465.1113 1473.3889 1487.7245 1495.0659 1641.8997 2952.8536 2969.8537 2974.9700 2981.5703 3032.0286 3050.0998 3061.3253 3065.0411 3071.4412 3100.2962 3482.9164 3512.5287
redmass: 3.7482 8.4094 2.5166 4.1071 4.0225 1.1326 1.0841 2.3461 1.6420 2.6108 2.1010 2.1761 3.9525 2.5054 1.4970 3.2233 3.1138 3.2506 2.5306 2.5709 1.2679 1.6255 1.7171 2.8095 2.6235 2.1532 1.9103 1.7109 1.9121 1.2551 1.3038 1.5915 1.5773 1.3438 1.3922 1.3345 1.2136 1.4921 1.2097 1.0870 1.0442 1.0507 1.0480 1.0543 8.6258 1.0794 1.0358 1.0417 1.0578 1.0938 1.0925 1.0994 1.0992 1.0988 1.0988 1.0652 1.0642
irintensity: 0.5303 4.8574 3.4214 3.0767 0.1286 4.5699 0.1416 42.0959 51.6031 48.4202 0.4641 5.6743 20.5611 4.9368 97.6704 30.5589 73.7551 1.7601 21.6224 14.9927 4.9999 4.7174 1.4392 73.5607 114.6319 149.8238 3.0630 8.7781 10.3344 25.7105 5.5834 62.1013 33.1322 3.7835 1.8955 3.5258 24.8753 20.6842 18.9520 6.1107 3.8064 8.3314 15.5396 13.4364 223.5651 20.4326 38.7546 38.7073 28.5403 1.7872 26.8375 46.9194 44.6307 53.4706 21.8712 30.3016 27.4842
temp: 298.150 k
press: 1.00000 atm
elementType: 8 8 8 6 6 6 6 6 6 1 1 1 1 1 1 1 1 1 1 1 1
symmnumber: 1
zpe: 459794.6 jmol-1
zpe.correction: 0.175127 hartree
zpe.thermalcorrener: 0.186066 hartree
zpe.thermalcorrenthalpy: 0.187010 hartree
zpe.thermalcorrgfe: 0.137845 hartree
zpe.sumelectzpe: -460.765666 hartree
zpe.sumelectthermal: -460.754726 hartree
zpe.sumelectthermalent: -460.753782 hartree
zpe.sumelectthermalfe: -460.802948 hartree
dipole: 0.5158 -2.1495 -1.1735
dipole: 2.5027
quadrupole: -52.2854 -56.9977 -56.0533
quadrupole: -4.3392 -0.1535 -0.7476
quadrupole: 2.8267 -1.8856 -0.9411 -4.3392 -0.1535 -0.7476
hfenergy: -460.9407926 hartree
pointgroup: C01 [X(C6H12O3)]
dipole: -0.1678675 -0.8234393 0.5130972 debye
dipolederiv: -0.4224918 -0.0673816 -0.1624411 -0.0135346 -0.6546641 0.1602565 -0.2004435 0.1484809 -0.4988914 -0.4016814 -0.3399001 -0.0165146 -0.3288334 -1.12402 0.0698449 0.0113649 0.1088768 -0.3885299 -0.8551784 0.2922714 0.0261476 0.0955263 -0.8400146 0.0491962 0.1428095 -0.0360535 -0.3106377 0.2175358 -0.0174388 0.007412 0.0298833 0.1647327 -0.0085649 -0.0903056 -0.0055731 0.1288916 -0.0096942 -0.0046351 -0.0097952 -0.0907898 0.0403455 0.0151662 0.1661937 0.0728732 0.0172718 -0.1784045 -0.033503 0.091568 0.0501716 0.543393 -0.1178444 0.0418621 -0.0831006 0.3496071 0.0082594 -0.0365006 0.0009622 -0.0370247 -0.0859656 0.0178917 0.0059501 0.0047416 0.0395012 -0.0230821 0.0167808 0.0504935 0.0023687 0.0043072 -0.0801353 0.0730812 -0.0687933 -0.0198077 1.2438724 -0.059485 -0.0938862 0.108446 1.4462226 -0.0637159 -0.2824841 -0.0394418 0.1841108 -0.0625503 0.0368535 -0.0805768 0.0373433 -0.0222415 0.0876773 -0.0627022 0.0880585 -0.132025 0.0256304 -0.0467604 -0.0057061 -0.0702862 -0.111781 0.0796105 -0.0021716 0.045852 0.0573876 0.0063059 0.0664987 0.0384636 0.067383 -0.0031831 -0.1312012 0.0232977 -0.0855791 -0.0686593 0.1270412 0.01539 0.0327236 -0.0102697 -0.0502544 -0.0420799 0.0093842 -0.0688934 -0.0274518 0.0831499 0.0377711 0.0749248 0.0108497 -0.0236134 -0.1058987 0.0363192 -0.1388875 -0.1085263 -0.2301802 -0.0382547 0.0227277 0.0114706 0.0700318 0.0017159 0.0370598 0.0021179 0.0942539 0.1293948 0.046811 -0.0538107 0.0208939 0.0387749 0.0477571 -0.0377093 0.0861136 -0.0237237 0.0756414 0.0323906 -0.0808092 0.050517 0.0259605 0.1008803 -0.0637271 0.0571076 -0.0860567 -0.2041345 0.0507426 0.0399478 0.0142476 0.0958069 -0.0110507 0.0016736 -0.0056659 0.0786386 0.0644023 -0.1241293 -0.0031847 -0.0928498 -0.1564241 -0.0295391 0.0085256 -0.0033608 0.0609316 0.2781468 0.1402049 0.0578366 0.0466911 0.3207579 -0.0316608 0.1087929 -0.077545 0.2763957 0.1280172 0.032274 0.0635171 0.0977963 0.3218288 -0.0083059 0.0732288 -0.0013279 0.3773195 unknown
polarizability: 89.803965|0.1912284|76.5594743|-1.9440577|-0.216463|59.194968 unknown
InChI: InChI=1S/C6H12O3/c1-4(2)3-5(7)6(8)9/h4-5,7-8H,3H2,1-2H3
charge 0 multiplicity 1
21 atoms
O  -0.24121 1.36236 -1.000279
O  -2.217722 -1.555792 0.002661
O  -2.720241 0.714941 -0.027802
C  2.005556 -0.282662 0.469789
C  0.469458 -0.341093 0.719538
C  -0.418097 -0.003484 -0.512365
C  2.552536 1.163324 0.393504
C  2.430039 -1.102845 -0.772324
C  -1.890782 -0.215153 -0.167964
H  2.463888 -0.766785 1.35913
H  0.200197 -1.367629 1.039095
H  0.204796 0.346329 1.547796
H  -0.154155 -0.677704 -1.346183
H  2.313177 1.728931 1.313975
H  3.653045 1.15434 0.278139
H  2.107337 1.701963 -0.459222
H  2.106172 -0.609002 -1.70737
H  3.53072 -1.194848 -0.815596
H  2.005625 -2.125091 -0.753697
H  -0.998962 1.909592 -0.656384
H  -3.179079 -1.642993 0.247058
