program: Gaussian 09
title: 000083688
version: EM64L-G09RevD.01
frameworkgroup: C1[X(C9H9N)]
method: RPBEPBE
basis: SDD
operation: Freq
keyword: #p
keyword: freq=noraman
keyword: PBEPBE/SDD
title: #p freq=noraman PBEPBE/SDD
converged: YES YES NO NO
title: Mulliken charges:
elementType: N C C C C C C C C C H H H H H H H H H
charge: -0.029852 0.313506 0.462045 0.282541 -0.527276 -0.396078 -0.383803 -0.793323 -0.801964 -0.274777 0.258667 0.237798 0.235927 0.245359 0.228154 0.245502 0.230240 0.226925 0.240408
chargesum: 0.00000
title: Mulliken charges with hydrogens summed into heavy atoms:
elementType: N C C C C C C C C C
charge: -0.029852 0.313506 0.462045 0.282541 -0.268609 -0.158280 -0.147876 -0.074308 -0.104390 -0.274777
polarizability: 1.40568407e+02 9.08959442e+00 1.10717301e+02 3.50791924e-01 -1.88910396e-01 5.04199299e+01
1716.lowfreq: -20.7500 -9.6993 -0.0006 0.0001 0.0005 8.0574 11.4294 81.2803 125.9808
frequency: -18.7594 81.2647 125.9793 132.0981 142.5382 275.3647 304.4790 367.1369 386.1545 434.6502 474.3306 491.6692 572.8361 604.2507 703.9835 732.6208 747.5675 831.5984 908.1440 910.5704 970.3525 993.2981 1011.2802 1046.2005 1050.7189 1114.6215 1165.7056 1222.2406 1254.6027 1288.3677 1366.0014 1395.8251 1401.1780 1403.2212 1465.2613 1466.3405 1473.9097 1478.8405 1495.2815 1576.6572 1619.9514 2171.4484 2979.3994 2983.4007 3061.3459 3061.5731 3089.8115 3095.0386 3123.8293 3142.0286 3148.0257
redmass: 1.0193 1.0690 3.1185 6.7409 4.2043 2.6735 3.4209 3.2043 4.2735 5.7404 3.0057 6.0580 5.5502 4.4993 6.2394 3.0854 4.3986 1.2828 2.0541 1.8554 1.3525 1.6919 1.3534 1.5598 1.5509 2.7965 1.4436 1.8286 4.6131 1.4112 6.7218 2.7497 1.2795 1.2324 1.0440 1.0908 1.0541 1.1109 3.1937 5.6163 6.3605 12.6326 1.0388 1.0374 1.0972 1.0953 1.0999 1.0994 1.0877 1.0928 1.0966
irintensity: 0.7337 1.3581 2.0061 3.4816 0.0864 1.5956 0.1261 0.1767 0.2895 0.2977 16.9416 0.0852 0.1544 2.3488 0.3076 1.0252 0.5664 34.3524 3.2392 4.2900 0.8667 4.1072 1.7087 2.1424 23.4811 2.7140 6.7374 0.7681 0.9530 2.4435 4.4033 0.4540 12.4644 14.5678 14.1984 0.2356 14.8946 30.1454 32.5425 4.7648 0.8718 36.9014 29.7132 16.3142 10.5446 22.3546 15.5723 17.7332 9.8036 13.1805 15.1247
temp: 298.150 k
press: 1.00000 atm
elementType: 7 6 6 6 6 6 6 6 6 6 1 1 1 1 1 1 1 1 1
symmnumber: 1
zpe: 396819.2 jmol-1
zpe.correction: 0.151140 hartree
zpe.thermalcorrener: 0.160182 hartree
zpe.thermalcorrenthalpy: 0.161126 hartree
zpe.thermalcorrgfe: 0.116896 hartree
zpe.sumelectzpe: -402.397171 hartree
zpe.sumelectthermal: -402.388130 hartree
zpe.sumelectthermalent: -402.387186 hartree
zpe.sumelectthermalfe: -402.431416 hartree
dipole: 3.7309 2.7211 0.0616
dipole: 4.6182
quadrupole: -61.7580 -58.1438 -61.4342
quadrupole: -10.3972 0.1374 -0.0423
quadrupole: -1.3126 2.3015 -0.9889 -10.3972 0.1374 -0.0423
hfenergy: -402.548312 hartree
pointgroup: C01 [X(C9H9N1)]
dipole: -1.6154117 -0.8313289 0.0246458 debye
dipolederiv: -0.43165 -0.108733 0.0000335 -0.1021893 -0.291972 -0.0000413 -0.0002393 -0.0005464 -0.2530048 0.2411584 -0.2654855 0.0043425 -0.0511434 0.0840318 -0.0018089 0.0024376 -0.0015337 -0.0348423 0.2586952 -0.28852 -0.0140781 -0.2641469 -0.0312791 0.0098354 -0.071917 0.0397854 -0.0315896 -0.1337833 -0.0971209 -0.0017591 0.0250312 0.0660785 -0.0031431 0.0028734 -0.0052624 0.0897307 -0.0625749 0.2070257 0.0018906 -0.0684459 0.0234431 0.0056999 0.0101846 0.0042775 -0.1546067 -0.2150274 0.1709657 0.0007605 0.0239137 0.1071167 0.0044321 0.0061882 -0.0010782 -0.156708 0.0266409 0.0354639 -0.003372 0.1502047 0.0290451 -0.0055133 0.0037214 -0.0098067 -0.1437679 -0.1512337 0.1418899 -0.000313 0.0633985 0.0619225 0.0002118 -0.0017984 0.0009185 0.0545635 -0.0736078 0.0967058 0.010408 0.1045594 -0.0029564 -0.0049893 0.0957013 -0.0568657 0.0616887 0.3754645 0.2393118 -0.000767 0.1976675 0.0719824 0.0003039 0.0000277 0.002787 0.0160228 0.0919888 -0.0036345 -0.0032576 0.0033603 -0.0689943 0.0011485 -0.0034796 0.0058804 0.1543999 0.0767401 0.0110441 -0.0012496 -0.0140694 -0.1180449 0.0001386 -0.0031553 0.0005211 0.1527968 -0.0943666 -0.0758492 -0.0024308 -0.067105 0.0612488 0.002867 -0.0074603 -0.0002289 0.1478698 0.0106307 0.0293032 -0.0827131 0.0053887 0.0638527 -0.0628293 -0.1046172 -0.0145452 -0.0246915 0.0688201 -0.1061352 0.0002161 0.0002712 -0.1363671 0.0010334 -0.0003348 0.0006841 0.1110747 0.0097177 0.0298245 0.0828551 0.0054698 0.0647928 0.061501 0.1049841 0.0137695 -0.0242949 0.0553292 -0.0493289 0.0394039 0.0295784 -0.0772019 0.0978269 -0.0208219 0.107539 0.0574364 -0.0675648 -0.0291123 -0.0684471 -0.1111041 0.0188951 -0.0678351 -0.0980788 -0.0236525 0.0710152 0.014623 0.0623848 0.0384773 0.0693604 0.0744062 -0.0388381 0.0857843 -0.0626429 -0.0930925 unknown
polarizability: 142.6289152|4.1076479|108.6577078|-0.2744458|0.1547637|50.4190149 unknown
InChI: InChI=1S/C9H9N/c1-7-3-4-8(2)9(5-7)6-10/h3-5H,1-2H3
charge 0 multiplicity 1
19 atoms
N  3.00863 1.4795 -0.004732
C  0.578887 -1.128985 0.002073
C  -1.81062 0.497186 -0.014306
C  0.649898 0.299663 -0.003437
C  -0.529049 1.093492 -0.013307
C  -0.709767 -1.711153 -0.00295
C  -1.879954 -0.919681 -0.012729
C  1.83487 -1.977737 0.008916
C  -3.068688 1.34713 0.004973
C  1.935748 0.94926 -0.004397
H  -0.432545 2.184887 -0.021073
H  -0.797135 -2.803632 -0.003484
H  -2.861316 -1.4091 -0.020464
H  2.459442 -1.765249 0.896439
H  1.587646 -3.05226 0.012622
H  2.464303 -1.772566 -0.87689
H  -2.924046 2.299356 -0.534535
H  -3.91993 0.818305 -0.457803
H  -3.361675 1.598786 1.042584
