program: Gaussian 09
title: 000083824
version: EM64L-G09RevD.01
frameworkgroup: C1[X(C21H26N2O4)]
method: RPBEPBE
basis: SDD
operation: Freq
keyword: #p
keyword: freq=noraman
keyword: PBEPBE/SDD
title: #p freq=noraman PBEPBE/SDD
converged: YES YES NO NO
title: Mulliken charges:
elementType: O O O O N N C C C C C C C C C C C C C C C C C C C C C H H H H H H H H H H H H H H H H H H H H H H H H H H
charge: -0.463948 -0.225366 -0.324672 -0.215752 -0.117020 -0.416281 -0.055697 -0.088112 0.075824 -0.052590 -0.532805 -0.498095 -0.511991 -0.291222 -0.395575 -0.465909 -0.102714 -0.440209 0.268009 -0.021260 0.233455 0.206489 -0.416352 -0.358666 -0.252833 -0.207271 -0.492256 0.238354 0.257757 0.227163 0.215042 0.239345 0.215805 0.188201 0.237477 0.254848 0.255004 0.194959 0.222214 0.193249 0.235298 0.199988 0.226119 0.200800 0.313908 0.271827 0.364343 0.234339 0.225302 0.225076 0.233460 0.247715 0.245221
chargesum: 0.00000
title: Mulliken charges with hydrogens summed into heavy atoms:
elementType: O O O O N N C C C C C C C C C C C C C C C C C C C C C
charge: -0.099604 -0.225366 -0.324672 -0.215752 -0.117020 -0.102373 0.182656 0.169645 0.075824 0.174573 -0.078418 -0.094088 -0.019666 -0.036217 0.021598 -0.037361 0.097273 -0.013290 0.268009 -0.021260 0.233455 0.206489 -0.144525 -0.124326 -0.027531 0.017805 0.234141
polarizability: 2.32508588e+02 2.65949828e+01 2.44880820e+02 1.60603610e+01 1.08970895e+00 2.39381853e+02
1716.lowfreq: -8.2959 -4.6901 0.0004 0.0006 0.0009 4.9515 19.4316 33.7107 38.0245
frequency: 19.2046 33.7001 37.9978 46.2472 60.8320 67.9966 87.1771 92.2694 112.7495 125.8171 155.2823 159.9451 177.9903 192.8200 214.8379 227.4736 243.2896 262.1471 274.9706 281.3946 299.0630 313.5452 324.0698 346.9607 361.9333 378.6770 396.7403 403.9608 455.5273 475.8135 480.5458 509.0833 514.1724 532.6789 558.8697 572.6717 597.0755 603.6881 611.5640 653.1770 664.2390 681.8406 695.6455 712.4401 716.0541 724.7417 756.2164 762.0394 765.3564 789.9534 811.2406 834.3371 855.6951 863.8761 868.2946 870.3303 901.4444 920.8378 938.1979 949.9910 960.8368 973.7451 976.6403 981.1833 996.3575 1008.9493 1016.8411 1030.8871 1036.8080 1061.6855 1074.1917 1083.1412 1083.8038 1088.4298 1108.0822 1112.1572 1113.9475 1123.2719 1145.1067 1152.0974 1156.8322 1162.7098 1165.2921 1168.2636 1179.9661 1189.4219 1208.4893 1209.7816 1223.8820 1232.7974 1235.6277 1241.8853 1258.0469 1268.5676 1270.7530 1279.8367 1285.9469 1290.7377 1296.2091 1309.3986 1317.6480 1318.6700 1329.6485 1335.7520 1336.5345 1346.2995 1350.0602 1354.4510 1365.2252 1379.9789 1397.3305 1415.9169 1423.6970 1449.0375 1451.6702 1453.1773 1458.7866 1460.0345 1465.4950 1465.9541 1469.4345 1473.6004 1492.6286 1605.9732 1629.1096 1649.4316 1660.8857 2817.5941 2828.9843 2875.9213 2935.5167 2948.4134 2976.9347 2981.9830 2984.9617 2990.3837 3009.4457 3011.8512 3013.7232 3023.8685 3031.6779 3043.3365 3050.8031 3058.9750 3093.0592 3114.6942 3128.6221 3139.9028 3151.7259 3151.9416 3166.0442 3449.1771 3578.6807
redmass: 5.0972 5.3938 4.8414 4.3650 2.8957 3.4346 3.9748 1.3120 5.9780 3.3725 3.0612 4.4905 3.5151 3.7415 3.5502 3.0470 3.9345 4.3861 3.9276 3.1025 4.3439 4.3522 3.5369 3.1104 3.5492 4.5694 3.0428 4.3956 3.1667 4.5490 3.7445 3.2265 1.4198 3.3994 1.9953 3.1194 1.8377 2.9310 4.1316 3.0523 6.6020 5.5457 3.8234 4.5395 4.7395 4.2440 1.5953 2.2993 3.7207 2.4234 1.8055 2.9903 2.3374 1.5625 4.1212 2.6594 2.0958 2.3821 1.6337 2.0454 1.7919 6.3257 1.5342 2.2376 2.5572 3.4514 2.2083 2.6949 3.2303 2.4003 2.9334 2.4287 2.9260 2.2400 1.9556 1.7226 1.4899 2.2048 1.5634 2.0472 1.6680 2.2163 2.2559 1.1235 1.9257 1.6222 1.5002 1.7780 1.6078 1.6840 1.3055 1.8533 1.2779 1.2955 1.6357 1.4647 1.3188 1.3519 1.5972 1.2802 1.3292 1.4374 1.4127 1.9725 1.3672 1.4276 1.5028 1.4388 1.5086 1.5167 1.5601 3.4106 1.1863 1.0979 1.0506 1.0847 1.0945 2.7173 1.0536 1.1290 1.0959 3.0147 1.0933 6.8568 7.1715 9.7578 9.6243 1.0793 1.0711 1.0711 1.0840 1.0814 1.0821 1.0615 1.0605 1.0655 1.0296 1.0877 1.0839 1.0667 1.0838 1.0995 1.1006 1.1008 1.1053 1.1050 1.0853 1.0900 1.0949 1.1054 1.1002 1.0652 1.0795
irintensity: 0.6200 2.4396 0.7514 1.1903 0.4593 1.8533 3.2792 0.1706 1.1047 0.1660 0.8661 1.1972 1.3158 0.3320 1.0015 7.7814 1.4481 6.4244 4.3812 3.5037 4.1583 4.7560 3.3024 3.9250 4.8280 3.0679 3.2165 1.2340 6.4198 5.4437 6.9977 27.1615 107.0905 0.6571 43.0439 4.7379 46.3539 21.2991 22.7879 25.1970 14.1286 9.6734 4.9831 1.7576 0.9277 8.9316 61.0223 37.2033 19.6534 1.8730 0.1869 0.8501 0.0934 0.6069 2.3594 3.2655 11.2936 0.9967 4.4169 7.6874 15.9108 47.6861 0.2947 2.4590 43.4548 13.5903 9.2211 17.7778 6.3704 3.8689 19.0042 9.7994 13.9643 19.4870 6.8111 10.5133 9.7959 8.7571 38.1369 8.9029 25.2076 101.7895 50.7821 6.0014 21.9425 23.1309 60.4832 19.8789 35.2106 4.0298 10.6162 33.3514 15.1315 15.7854 24.7735 12.1823 5.1625 3.2723 5.6478 5.0290 1.7201 9.7552 26.9956 34.1602 1.0536 3.5441 7.1082 4.6826 4.5799 6.3548 40.3787 0.2531 25.2024 2.1105 15.3366 9.5463 7.8232 33.8448 13.6768 10.3867 6.9869 59.5949 6.8160 3.1344 73.1999 143.0866 345.6375 15.4040 95.3216 126.1749 65.2997 15.1677 6.9325 44.8260 22.7216 43.1258 32.3391 29.3163 18.7129 14.2477 50.3931 37.4828 21.8118 40.7010 16.1863 21.9164 0.8738 10.7485 18.7115 11.7279 23.2675 82.3307 38.6503
temp: 298.150 k
press: 1.00000 atm
elementType: 8 8 8 8 7 7 6 6 6 6 6 6 6 6 6 6 6 6 6 6 6 6 6 6 6 6 6 1 1 1 1 1 1 1 1 1 1 1 1 1 1 1 1 1 1 1 1 1 1 1 1 1 1
symmnumber: 1
zpe: 1151549.2 jmol-1
zpe.correction: 0.438602 hartree
zpe.thermalcorrener: 0.462697 hartree
zpe.thermalcorrenthalpy: 0.463641 hartree
zpe.thermalcorrgfe: 0.384177 hartree
zpe.sumelectzpe: -1224.249532 hartree
zpe.sumelectthermal: -1224.225437 hartree
zpe.sumelectthermalent: -1224.224493 hartree
zpe.sumelectthermalfe: -1224.303957 hartree
dipole: 0.7041 0.7714 1.4132
dipole: 1.7573
quadrupole: -158.5960 -143.9624 -165.5345
quadrupole: -1.0440 5.0256 -9.4367
quadrupole: -2.5650 12.0685 -9.5035 -1.0440 5.0256 -9.4367
hfenergy: -1224.6881339 hartree
pointgroup: C01 [X(C21H26N2O4)]
dipole: -0.282871 0.3651213 -0.5144349 debye
polarizability: 233.7530079|-28.7008917|243.6678352|12.5034176|-0.228187|239.3504181 unknown
InChI: InChI=1S/C21H26N2O4/c1-27-19(25)18-13-10-17-21(14-4-2-3-5-15(14)22-20(21)26)8-9-23(17)11-12(13)6-7-16(18)24/h2-5,12-13,16-18,22,24H,6-11H2,1H3
charge 0 multiplicity 1
53 atoms
O  4.737331 -0.156769 0.584176
O  -2.224881 0.054393 3.184983
O  3.233609 2.047617 1.212381
O  2.104566 3.041616 -0.562724
N  -0.472848 -2.244925 -0.011667
N  -3.170072 1.303324 1.409684
C  -0.557545 -0.964696 0.736837
C  1.779077 -0.388716 -0.00412
C  -2.10605 -0.732784 0.793345
C  1.838513 -1.73884 -0.776073
C  0.317133 0.116074 0.087582
C  0.902855 -2.770989 -0.107623
C  -2.643076 -2.196333 1.020168
C  2.722728 0.641319 -0.700543
C  -1.464639 -3.141637 0.632622
C  3.286085 -2.273133 -0.874243
C  4.191775 0.10243 -0.75267
C  4.237716 -1.236581 -1.510856
C  -2.693235 -0.024861 -0.418172
C  -2.483478 0.213911 1.962685
C  -3.315817 1.182059 0.002637
C  2.63198 2.022924 -0.0701
C  -2.703874 -0.375249 -1.777239
C  -3.955839 2.05128 -0.897694
C  -3.342855 0.489133 -2.705788
C  -3.960175 1.684911 -2.267894
C  3.181437 3.34566 1.931551
H  -0.222601 -1.101699 1.8007
H  2.167024 -0.563111 1.021423
H  1.449406 -1.555307 -1.801682
H  0.261716 1.043958 0.689657
H  -0.064658 0.351414 -0.923311
H  0.88615 -3.703208 -0.704623
H  1.311224 -3.032559 0.905187
H  -3.538887 -2.371232 0.402902
H  -2.917783 -2.329624 2.080531
H  2.3779 0.779006 -1.744363
H  -1.044965 -3.617285 1.553169
H  -1.766458 -3.948118 -0.059629
H  3.300872 -3.209357 -1.466319
H  3.659039 -2.515749 0.138964
H  4.824662 0.853033 -1.276609
H  5.278795 -1.607059 -1.491223
H  3.966047 -1.05944 -2.570791
H  -3.532199 2.069336 1.9774
H  -2.21212 -1.297777 -2.102919
H  4.492913 0.618299 1.161247
H  -4.434289 2.978516 -0.564233
H  -3.357409 0.230487 -3.770034
H  -4.449639 2.341421 -2.995994
H  3.691971 3.160656 2.886917
H  2.131877 3.641108 2.092515
H  3.694888 4.126553 1.346575
