program: Gaussian 09
title: 000083647
version: EM64L-G09RevD.01
frameworkgroup: C1[X(C10H8ClNO)]
method: RPBEPBE
basis: SDD
operation: Freq
keyword: #p
keyword: freq=noraman
keyword: PBEPBE/SDD
title: #p freq=noraman PBEPBE/SDD
converged: NO NO NO NO
title: Mulliken charges:
elementType: Cl O N C C C C C C C C C C H H H H H H H H
charge: -0.040631 -0.263391 0.074522 0.458965 -0.084609 -0.529701 0.326362 -0.310309 -0.294447 -0.335923 -0.132723 -0.310090 -0.536593 0.259809 0.264852 0.250560 0.249226 0.256705 0.249346 0.224038 0.224032
chargesum: 0.00000
title: Mulliken charges with hydrogens summed into heavy atoms:
elementType: Cl O N C C C C C C C C C C
charge: -0.040631 -0.263391 0.074522 0.458965 -0.084609 -0.269892 0.326362 -0.045457 -0.043887 -0.086697 0.123981 -0.310090 0.160823
polarizability: 2.36033387e+02 8.98641793e+00 1.20438289e+02 1.96628372e-03 1.10451144e-03 5.29813706e+01
1716.lowfreq: -0.0022 -0.0014 0.0017 5.5587 14.0733 28.2474 56.5750 97.2293 157.7286
frequency: 56.3659 97.1869 157.7238 178.5183 188.1930 252.6660 253.5955 290.1132 356.0354 397.6087 413.4493 447.9335 482.7927 518.9532 547.7823 565.7167 634.3696 671.3104 711.0103 764.7383 776.6620 815.1935 829.6545 882.1326 890.2627 925.6883 964.9329 973.9138 999.4639 1084.8163 1112.2389 1127.6806 1139.9913 1160.6627 1176.8909 1245.7880 1262.3517 1289.3783 1358.4107 1397.1753 1408.6479 1438.6757 1455.9150 1470.0924 1475.6920 1500.7324 1546.3505 1580.8030 1634.5415 2959.8444 3047.6504 3127.7975 3141.4965 3150.0561 3152.3577 3172.8452 3180.5232
redmass: 5.0775 4.3934 5.9630 3.5966 3.9971 1.2735 4.6508 9.0783 5.0701 5.1786 3.6653 6.8629 3.3161 6.8940 4.9391 3.3724 7.6215 3.9375 6.8285 5.7560 2.7526 1.3488 1.7953 6.6687 1.6592 4.3946 1.3366 1.3512 4.0943 2.8364 1.2567 1.9106 1.4291 1.2521 1.6159 1.9424 2.6640 2.4160 3.1840 3.1742 6.0799 1.3732 2.5464 1.0496 1.0850 3.7473 7.8277 6.6962 6.9482 1.0333 1.1040 1.0993 1.0902 1.0875 1.0921 1.0971 1.0971
irintensity: 0.9184 7.6516 2.3517 3.6725 2.5181 1.6580 2.2231 6.6443 0.1045 5.6724 1.6240 4.9324 8.9976 3.5778 40.5501 0.3219 10.9185 3.3457 1.1089 5.6748 0.0408 22.8547 44.3264 37.2453 50.6705 5.1810 0.5665 2.7246 57.0165 139.5356 0.1825 17.1645 19.8789 22.1120 81.0525 17.0835 215.6148 5.8789 43.8826 5.5121 3.8385 2.9895 8.7573 14.1593 74.0899 100.8012 60.4839 99.4327 73.5659 76.5587 46.2473 23.7598 5.1963 4.7410 5.2166 8.0016 4.6823
temp: 298.150 k
press: 1.00000 atm
elementType: 17 8 7 6 6 6 6 6 6 6 6 6 6 1 1 1 1 1 1 1 1
symmnumber: 1
zpe: 405793.5 jmol-1
zpe.correction: 0.154559 hartree
zpe.thermalcorrener: 0.165410 hartree
zpe.thermalcorrenthalpy: 0.166355 hartree
zpe.thermalcorrgfe: 0.117483 hartree
zpe.sumelectzpe: -974.976267 hartree
zpe.sumelectthermal: -974.965415 hartree
zpe.sumelectthermalent: -974.964470 hartree
zpe.sumelectthermalfe: -975.013342 hartree
dipole: -4.6529 1.0649 0.0004
dipole: 4.7732
quadrupole: -74.9114 -75.5033 -85.4537
quadrupole: 14.0664 -0.0018 0.0002
quadrupole: 3.7114 3.1195 -6.8309 14.0664 -0.0018 0.0002
hfenergy: -975.1308251 hartree
pointgroup: C01 [X(C10H8Cl1N1O1)]
dipole: 1.8184304 0.468917 -0.0004739 debye
dipolederiv: -1.107294 -0.133177 0.0000909 -0.3275537 -0.1736106 0.0000351 0.0000045 0.0000143 -0.0987791 -2.0547922 0.1350657 0.0003236 -0.2517581 -0.2739444 0.0000368 0.000424 -0.0000576 -0.3000815 -0.7017725 -0.1061738 0.0000109 0.3843374 -0.3771628 0.0000305 -0.00005 0.0000354 -0.1599226 0.232082 0.0234798 -0.0000349 0.287417 -0.2027651 -0.000002 -0.0000615 0.0000414 0.0695972 0.1731883 0.1273821 -0.0000152 -0.3192299 -0.001099 0.0000465 0.000027 -0.0000004 0.0254034 -0.5213755 -0.0404006 0.0000861 0.2410122 0.070076 -0.0000791 0.000065 -0.0000448 -0.1954974 1.7351816 0.1218352 -0.0003331 0.6182486 0.0157579 -0.0001293 -0.0004488 -0.0000096 0.107837 0.1087452 -0.1175384 -0.0000196 0.0100753 0.1560357 -0.0000482 -0.0000285 -0.0000357 -0.1329545 0.2188636 -0.0072711 -0.0000438 -0.1070006 0.1920877 -0.0000467 -0.0000433 -0.0000438 -0.1334281 -0.3354547 0.0165419 0.000038 -0.4028252 0.0202979 0.0000405 0.0000976 -0.0000454 -0.1863032 -0.4619811 -0.1247958 0.000048 -0.336199 -0.0478502 0.0000307 0.00004 0.0000162 -0.0880172 1.7237089 0.2896851 -0.0001154 0.409322 0.3756073 -0.0001224 -0.0000009 -0.0000933 0.000141 0.8631512 -0.1498566 -0.0000962 -0.5044268 0.3309319 0.0001047 -0.0000785 0.0000357 0.3251175 0.069102 -0.0108326 0.0000137 -0.0664153 -0.038728 0.0000471 0.0000295 0.0000459 0.1728629 0.0857448 -0.0500559 0.0000203 -0.0102368 -0.0312886 0.0000355 0.0000083 0.0000419 0.1583069 0.0600028 -0.0705761 0.0000189 -0.0101244 -0.0659635 0.0000361 0.0000302 0.0000376 0.1479191 -0.0231836 0.0986066 0.0000053 0.0974023 0.0267049 0.0000077 0.0000072 0.0000072 0.1634302 0.0080917 0.0821033 0.0000088 0.0663712 0.0399578 0.0000138 0.0000016 0.0000145 0.1702226 -0.1230018 -0.0602058 0.0000824 -0.1200707 0.0428836 0.0000515 0.0001005 0.000036 0.1256473 0.0254912 -0.0119531 -0.0436056 0.1707863 -0.028987 -0.1138655 0.0251484 -0.1116648 -0.0857113 0.0255023 -0.011863 0.0435169 0.1708679 -0.0289415 0.1137769 -0.0252725 0.1116695 -0.0857904 unknown
polarizability: 236.4385637|-5.8098893|120.0331081|-0.0236208|-0.0094396|52.9813751 unknown
InChI: InChI=1S/C10H8ClNO/c1-13-8-3-4-9-7(6-8)2-5-10(11)12-9/h2-6H,1H3
charge 0 multiplicity 1
21 atoms
Cl -4.568094 -0.726428 0.000472
O  3.484215 0.643148 -0.00072
N  -1.8825 -1.075369 0.000392
C  -0.20784 0.765785 -0.00014
C  -0.56122 -0.64456 0.000129
C  1.163541 1.146124 -0.000385
C  2.167407 0.166265 -0.000358
C  0.483497 -1.618881 0.000169
C  -1.291743 1.711428 -0.000138
C  1.824257 -1.228923 -0.000084
C  -2.610811 1.261465 0.000102
C  -2.82955 -0.154907 0.000409
C  4.57524 -0.335495 -0.00102
H  1.452606 2.202302 -0.000614
H  0.197589 -2.674936 0.000395
H  -1.078025 2.786064 -0.00034
H  2.609775 -1.991056 -0.000061
H  -3.458521 1.951309 0.000068
H  5.496538 0.264943 -0.001421
H  4.546446 -0.974248 -0.905594
H  4.547095 -0.97403 0.903739
