program: Gaussian 09
title: 000083646
version: EM64L-G09RevD.01
frameworkgroup: C1[X(C9H6N2O3)]
method: RPBEPBE
basis: SDD
operation: Freq
keyword: #pfreq=noraman
keyword: PBEPBE/SDD
title: #p freq=noraman PBEPBE/SDD
converged: NO NO NO NO
title: Mulliken charges:
elementType: O O O N N C C C C C C C C C H H H H H H
charge: -0.325273 -0.195416 -0.200720 -0.033254 0.020993 0.432355 0.188485 -0.525020 -0.330445 0.401675 -0.335374 -0.362164 -0.157046 -0.261402 0.295277 0.306954 0.261103 0.294438 0.239574 0.285260
chargesum: 0.00000
title: Mulliken charges with hydrogens summed into heavy atoms:
elementType: O O O N N C C C C C C C C C
charge: -0.325273 -0.195416 -0.200720 -0.033254 0.020993 0.432355 0.188485 -0.229743 -0.023492 0.401675 -0.074271 -0.067726 0.082528 0.023858
polarizability: 2.06190218e+02 -6.71004077e+00 1.50457012e+02 2.99770632e-02 -7.27648927e-03 4.50850338e+01
1716.lowfreq: -7.3563 -3.2359 0.0003 0.0004 0.0008 14.6564 66.6236 85.5052 136.4267
frequency: 66.1896 85.5011 136.4194 174.2421 247.1195 262.1460 285.2919 345.5243 422.7822 475.0216 482.8918 487.7329 541.2980 568.7085 576.3590 602.1625 617.9804 700.3521 715.9101 742.3407 745.0476 798.7523 837.6813 860.3678 877.0091 911.8701 940.4334 968.4406 1008.0406 1042.9301 1070.0851 1088.4322 1134.6894 1177.0086 1202.9480 1224.8126 1235.5259 1257.8888 1294.4607 1354.7340 1380.7076 1416.6310 1433.1238 1444.6986 1521.3641 1552.4855 1592.2198 1623.6581 3160.1337 3170.1998 3177.3237 3179.4768 3195.5248 3210.5974
redmass: 12.9960 7.8689 4.8169 9.0980 4.1164 6.3741 12.0396 7.7206 3.2534 7.0228 3.7965 10.0224 5.3935 7.7884 4.3863 7.4457 3.7260 3.7908 6.0526 10.7232 2.4489 1.8039 6.1401 1.5080 1.3969 4.3443 1.5101 1.3406 1.3092 3.1700 2.0375 2.0308 1.2307 1.5007 5.9587 3.1155 2.3926 1.9898 2.6524 4.2873 4.6633 2.6894 3.0114 4.4043 4.8824 5.7000 7.2226 7.7977 1.0879 1.0926 1.0890 1.0969 1.0972 1.0960
irintensity: 0.6461 3.5068 4.1289 3.8046 0.8171 2.4923 0.8410 4.1805 5.4513 2.7147 0.9053 4.2410 0.7528 3.6504 7.7611 0.6963 0.1402 2.7117 0.3773 39.2243 30.8487 61.2061 6.1564 26.2622 14.3366 5.3105 29.3463 5.6243 0.5387 13.6602 18.1983 14.4143 5.2851 43.3776 269.7699 66.5302 41.1291 16.0328 13.6404 37.2921 132.6901 5.7477 8.5002 5.6960 6.1742 29.6225 7.7713 7.8794 1.6436 3.5219 6.5854 8.2422 1.7787 0.0601
temp: 298.150 k
press: 1.00000 atm
elementType: 8 8 8 7 7 6 6 6 6 6 6 6 6 6 1 1 1 1 1 1
symmnumber: 1
zpe: 362619.7 jmol-1
zpe.correction: 0.138115 hartree
zpe.thermalcorrener: 0.148506 hartree
zpe.thermalcorrenthalpy: 0.149451 hartree
zpe.thermalcorrgfe: 0.101526 hartree
zpe.sumelectzpe: -680.633518 hartree
zpe.sumelectthermal: -680.623126 hartree
zpe.sumelectthermalent: -680.622181 hartree
zpe.sumelectthermalfe: -680.670106 hartree
dipole: -3.6985 2.9305 -0.0142
dipole: 4.7188
quadrupole: -95.9842 -76.7268 -81.1197
quadrupole: -13.7844 -0.0551 -0.0014
quadrupole: -11.3740 7.8835 3.4905 -13.7844 -0.0551 -0.0014
hfenergy: -680.7716321 hartree
pointgroup: C01 [X(C9H6N2O3)]
dipole: -1.4654675 1.1397573 -0.0055951 debye
dipolederiv: -0.4527009 -0.2638102 0.0000782 -0.4538303 -0.9049454 0.0002365 0.0002815 0.0001249 -0.3039857 -0.7962924 0.2155873 0.0003846 0.1661625 -0.6223166 -0.0016736 -0.0024425 0.0024739 -0.2205834 -0.7463936 -0.1574292 -0.0001151 -0.2720823 -0.6545719 0.0017504 -0.0025091 -0.002616 -0.2224204 0.0766811 0.4000826 -0.0000989 0.6914011 0.8298704 -0.0002585 -0.0000868 -0.0001749 0.1050158 1.9062467 -0.0596224 0.0011659 0.1358782 1.0664138 0.0001165 0.001845 -0.0001155 0.1880527 0.0033575 -0.1483215 -0.0000143 -0.2169427 -0.0010309 0.0001848 -0.0003227 0.0002681 0.0799317 0.0912908 -0.4108692 0.0000589 -0.0252119 -0.0020876 0.0000148 -0.0000028 0.0001399 0.0258105 0.1872271 0.1199734 -0.0001463 -0.1637576 -0.0349468 -0.0002863 0.0016092 -0.0000279 -0.1152586 -0.1899704 0.2083808 -0.0001221 -0.0444364 -0.0270254 -0.0000414 0.0003647 -0.0003526 -0.103512 -0.6506568 0.0660785 -0.0010767 0.074706 0.1522881 -0.0001293 0.0008529 0.0002828 0.0781349 -0.221905 0.0951297 -0.0000412 -0.025102 -0.0306478 -0.0001446 -0.000281 -0.00009 -0.1855332 0.0009649 -0.2019404 -0.0001529 0.2402625 -0.0505466 0.0001721 0.0010697 -0.0000356 -0.1321216 0.1487314 -0.1024972 -0.0000869 0.1047643 0.1465088 -0.0000889 0.0001071 -0.0000628 -0.0947382 0.1868782 0.2472866 -0.0001788 -0.2568131 -0.1605202 0.0000209 -0.0001803 -0.0001201 -0.136957 0.1227506 -0.00226 0.0000804 -0.0202003 0.0506246 0.0000629 0.0001323 -0.0001129 0.1696625 0.1023758 -0.0708407 -0.000024 0.0151353 0.0788394 0.0000245 -0.0003581 0.0001705 0.1714681 0.0632324 -0.0744675 0.0000723 -0.0142099 -0.0143789 0.000051 -0.0000103 0.0000595 0.1720019 0.1049616 0.0614869 0.0001107 0.0103325 0.0873365 -0.0000385 -0.0001387 0.0001381 0.1743449 0.0173181 0.0906145 0.0000365 0.092917 0.0205577 -0.0000157 0.0000763 0.000024 0.1627124 0.0459029 -0.012562 0.0000699 -0.0389729 0.0705788 0.0000423 -0.0000063 0.0000269 0.1879745 unknown
polarizability: 206.3070352|-6.2048688|150.3401945|0.0300417|-0.0070051|45.0850338 unknown
InChI: InChI=1S/C9H6N2O3/c12-10-5-1-2-7-6-8(11(13)14)3-4-9(7)10/h1-6H
charge 0 multiplicity 1
20 atoms
O  -2.888086 -1.998268 0.000876
O  3.958966 -0.916814 0.00453
O  3.635712 1.344772 0.004346
N  -2.431701 -0.747513 0.000566
N  3.199609 0.128307 -0.002725
C  -0.527069 0.844159 -0.000676
C  -1.021148 -0.509098 -0.000213
C  0.890132 1.029206 -0.001389
C  -0.146702 -1.628973 -0.000497
C  1.725703 -0.087387 -0.001767
C  -1.449809 1.941601 -0.000382
C  1.233521 -1.426716 -0.001214
C  -2.819186 1.659125 0.000322
C  -3.292803 0.327845 0.000762
H  1.326423 2.032493 -0.001795
H  -0.596177 -2.62514 -0.000129
H  -1.077997 2.969642 -0.000712
H  1.946078 -2.254686 -0.00152
H  -3.563853 2.460179 0.000541
H  -4.349913 0.058566 0.001278
