program: Gaussian 09
title: 000083625
version: EM64L-G09RevD.01
frameworkgroup: C1[X(C8H10N)]
method: RPBEPBE
basis: SDD
operation: Freq
keyword: #p
keyword: freq=noraman
keyword: PBEPBE/SDD
title: #p freq=noraman PBEPBE/SDD
converged: YES YES NO NO
title: Mulliken charges:
elementType: N C C C C C C C C H H H H H H H H H H
charge: -0.133707 0.370132 -0.166856 -0.254344 -0.621418 -0.143017 -0.145862 -0.132864 -0.490130 0.280806 0.272858 0.289610 0.259539 0.282023 0.280946 0.288393 0.260515 0.263197 0.240180
chargesum: 1.00000
title: Mulliken charges with hydrogens summed into heavy atoms:
elementType: N C C C C C C C C
charge: -0.133707 0.370132 0.113949 0.018514 0.209754 0.137930 0.142530 0.127651 0.013246
polarizability: 1.34546701e+02 -4.82966464e+00 9.65839721e+01 -6.27987567e-01 2.24362486e+00 4.05315480e+01
1716.lowfreq: -4.8807 -0.0006 -0.0005 -0.0004 7.5400 11.9441 71.8239 132.4790 203.3711
frequency: 71.8154 132.4677 203.3709 230.3361 266.3485 373.1905 422.9450 458.2459 491.1889 517.6387 597.5816 625.4744 743.0620 760.7648 789.1460 813.8061 894.2834 969.9103 980.3564 1008.3884 1018.3043 1027.1937 1041.7616 1079.1954 1119.0488 1136.2746 1173.1541 1192.5073 1241.6023 1303.4438 1326.5220 1349.3650 1419.6749 1445.9557 1454.9917 1475.4698 1476.6693 1506.5019 1566.0161 1620.4754 1633.1274 3023.4346 3116.0206 3125.3244 3148.5900 3158.6888 3176.6636 3191.9039 3199.4247 3210.4826 3225.9955
redmass: 2.1552 2.4386 1.4770 2.4554 1.9923 3.1365 2.4645 2.7182 4.7028 3.3241 4.4347 2.0318 3.9207 2.1126 1.5601 4.6047 1.3709 1.3656 1.1029 1.3887 1.3643 1.7496 1.7950 1.8901 1.3656 1.9077 2.7075 1.0937 2.0930 1.6912 1.3639 3.0632 1.4523 1.2854 1.5886 1.2665 1.0702 1.6335 5.6815 5.1226 4.1966 1.0347 1.0628 1.1035 1.1025 1.0924 1.0908 1.0917 1.0963 1.1021 1.1150
irintensity: 0.6472 0.0087 4.3022 1.0450 1.9305 0.8812 14.0685 0.6369 2.3864 2.4089 0.5668 1.3436 0.7482 10.4754 79.0867 2.6790 0.8517 0.0549 48.5525 34.3580 2.5505 6.9081 3.4691 0.5954 2.1540 5.9585 22.8959 3.6116 3.2225 0.8447 0.2738 25.6404 14.1767 26.0800 16.7277 11.3112 27.7602 90.2634 65.0833 56.2695 15.3949 1.4869 1.9632 1.8474 2.2060 1.5837 0.2993 0.6329 0.4880 1.8114 1.7468
temp: 298.150 k
press: 1.00000 atm
elementType: 7 6 6 6 6 6 6 6 6 1 1 1 1 1 1 1 1 1 1
symmnumber: 1
zpe: 421887.6 jmol-1
zpe.correction: 0.160689 hartree
zpe.thermalcorrener: 0.168960 hartree
zpe.thermalcorrenthalpy: 0.169905 hartree
zpe.thermalcorrgfe: 0.127765 hartree
zpe.sumelectzpe: -364.688041 hartree
zpe.sumelectthermal: -364.679769 hartree
zpe.sumelectthermalent: -364.678824 hartree
zpe.sumelectthermalfe: -364.720964 hartree
dipole: -0.6241 1.0173 -0.0686
dipole: 1.1955
quadrupole: -27.6236 -31.1235 -54.8197
quadrupole: -0.4805 0.2412 0.6722
quadrupole: 10.2320 6.7321 -16.9641 -0.4805 0.2412 0.6722
hfenergy: -364.8487291 hartree
pointgroup: C01 [X(C8H10N1)]
dipole: -0.2357444 0.4065344 -0.0194238 debye
dipolederiv: -0.1794691 -0.1830175 -0.0094493 0.0856207 -0.3228491 0.0020401 -0.0057119 0.0021237 -0.0533302 0.9033319 -0.1934891 -0.0032923 0.3071737 0.1118921 -0.031171 -0.0091879 -0.0367832 0.1189183 -0.0988401 0.2872716 0.0117169 -0.3031072 0.2717277 0.0029654 0.0059773 0.0143985 -0.0176244 -0.5272391 -0.0800436 0.016453 -0.4819968 0.0065456 -0.0193018 -0.037384 0.0019231 -0.0779022 0.0965331 0.0644658 0.0086324 0.0015982 0.3560776 0.0016797 0.0231584 -0.0233368 0.1398854 0.0614138 -0.0015244 0.0135917 0.4120521 -0.3806682 0.0006233 -0.0031942 -0.0026039 -0.0848772 0.4426441 0.0022079 0.002032 -0.0494574 0.2965248 0.0003999 0.0211041 -0.0010812 -0.0243524 -0.5313067 0.1369225 0.0185938 0.3163299 -0.0158949 0.0728449 0.1675272 0.0736521 -0.1418414 0.1618385 0.0125109 0.0203916 -0.2049971 0.0898066 0.1245846 -0.0158568 0.104495 -0.1698178 0.1164402 0.0008409 -0.0029963 0.0255534 0.0385841 0.0027649 0.0058474 0.0002513 0.1695436 0.0474331 0.0653899 -0.0113706 0.0300544 0.0767924 0.0043088 -0.0153995 -0.0031171 0.1541808 0.0755388 -0.0398436 0.0741283 0.001176 0.0734356 -0.0462181 0.061294 -0.0160428 0.0452921 -0.0193059 0.1065322 -0.0285824 0.0039817 0.0758192 0.0055146 -0.0220803 0.0155179 0.138835 0.1003394 -0.0480148 -0.0604929 -0.0060668 0.0633353 0.0370066 -0.0557024 0.0045886 0.0009252 0.0551709 0.0058188 -0.0061196 0.0112516 0.1126984 0.0012876 -0.0055732 0.0004683 0.1745237 0.1060907 -0.0273127 -0.0029186 -0.0302402 0.0419443 0.0005988 0.0055608 0.0013912 0.1576039 0.0556261 0.003385 0.0035193 -0.0249177 -0.0137539 -0.0646216 -0.0568648 -0.0548079 0.1498344 0.0360064 -0.0299645 -0.0151946 -0.0264427 0.1064052 -0.0301091 -0.036301 -0.0183934 0.1703063 0.0977537 -0.0821353 -0.0286422 -0.0675658 0.0115772 -0.0651974 -0.0272131 -0.0626434 0.1498971 unknown
polarizability: 134.2963367|-5.7414163|96.7171881|-0.2582839|3.4274214|40.6486965 unknown
InChI: InChI=1S/C8H10N/c1-3-8-6-4-5-7-9(8)2/h3-7H,1H2,2H3
charge 1 multiplicity 1
19 atoms
N  -0.317353 0.985017 0.012028
C  0.54681 -0.111127 0.060732
C  -1.686552 0.819398 -0.048721
C  -0.031125 -1.40775 0.043432
C  0.22526 2.379812 0.01009
C  -2.26648 -0.450547 -0.072689
C  -1.422067 -1.587773 -0.029958
C  1.996572 0.119945 0.15013
C  2.942686 -0.807586 -0.171251
H  -2.28541 1.731498 -0.080263
H  0.632135 -2.271869 0.116186
H  0.967754 2.494548 -0.794464
H  -0.599308 3.08416 -0.166532
H  0.68727 2.611695 0.983527
H  -3.35354 -0.541769 -0.120127
H  -1.848134 -2.594883 -0.040346
H  2.335808 1.099727 0.500804
H  4.005878 -0.572852 -0.062176
H  2.704995 -1.800942 -0.568201
