program: Gaussian 09
title: 000083658
version: EM64L-G09RevD.01
frameworkgroup: C1[X(C11H12N2O)]
method: RPBEPBE
basis: SDD
operation: Freq
keyword: #p
keyword: freq=noraman
keyword: PBEPBE/SDD
title: #p freq=noraman PBEPBE/SDD
converged: YES YES NO NO
title: Mulliken charges:
elementType: O N N C C C C C C C C C C C H H H H H H H H H H H H
charge: -0.449673 -0.455352 -0.153918 0.250695 0.073964 0.050565 0.353932 -0.395382 -0.790655 -0.374603 -0.360629 -0.224488 -0.238113 -0.241923 0.309249 0.206503 0.202483 0.247489 0.242007 0.236713 0.269334 0.192067 0.229285 0.225780 0.231201 0.363468
chargesum: 0.00000
title: Mulliken charges with hydrogens summed into heavy atoms:
elementType: O N N C C C C C C C C C C C
charge: -0.086204 -0.146103 -0.153918 0.250695 0.073964 0.050565 0.353932 0.013604 -0.064445 -0.105269 -0.168562 0.004796 -0.012333 -0.010722
polarizability: 2.26265906e+02 -1.08000366e+01 1.41761041e+02 -3.08827597e+00 -3.26626005e+00 6.33428524e+01
1716.lowfreq: -8.3121 -2.0079 -0.0008 -0.0008 -0.0006 4.8675 12.2516 29.6323 76.2955
frequency: 9.8335 29.5642 76.2908 98.9743 106.6475 168.7406 204.2817 217.8209 266.9704 321.6721 326.2957 399.7223 419.1144 456.8211 499.7458 528.9448 612.8863 624.5162 638.0591 651.4933 669.6899 696.9785 701.1507 780.1718 794.3279 842.7598 919.5470 943.0372 969.4135 976.3822 979.9783 987.6019 1001.5650 1005.9830 1023.7255 1043.3163 1077.8313 1095.6743 1137.0845 1172.9512 1189.9744 1193.6099 1246.0224 1268.2964 1303.1777 1309.4292 1350.3476 1384.2090 1389.1350 1409.2755 1415.9642 1443.8765 1458.4372 1468.1589 1476.1916 1480.2028 1535.3430 1586.0577 1600.1822 1619.2970 2936.9151 2971.0868 3038.7423 3042.3602 3094.1492 3109.7932 3131.1493 3143.3646 3159.3967 3171.1093 3463.0081 3586.9905
redmass: 4.0540 3.4790 4.5870 1.6927 1.6341 4.5758 3.5004 2.8358 3.6059 5.9266 3.8924 2.7686 4.1967 1.1812 3.4371 3.8448 5.9207 4.4951 1.3350 3.5442 5.3351 1.5947 5.8843 2.1725 5.1735 1.2658 1.4455 8.9411 3.4471 1.3734 1.8983 5.1608 1.3353 1.9003 2.3300 1.4657 1.7257 2.4111 2.4094 1.0562 1.1748 1.2812 2.4712 1.7748 1.6951 1.9119 2.4121 6.5737 1.7048 1.2311 2.5868 2.4839 2.0035 1.0637 1.2014 1.0925 4.8933 6.1429 5.8744 5.9067 1.0700 1.0389 1.0921 1.0983 1.0959 1.0875 1.0865 1.0923 1.0959 1.0998 1.0653 1.0808
irintensity: 4.1979 2.4815 1.4263 0.5905 0.9606 2.3647 0.0776 2.4614 2.4713 0.2655 4.9965 0.4983 16.5715 144.1937 5.2857 5.9668 2.5074 10.5082 50.0855 8.4203 6.7333 110.0045 1.7824 41.9269 8.6885 0.0291 5.2524 12.6776 85.2984 0.3840 14.3031 0.6035 0.6570 1.0329 5.8452 4.8451 9.0252 4.3781 5.4930 0.0384 7.5349 19.5654 43.5803 23.1853 19.4259 6.0380 25.9071 17.7563 33.9401 18.2960 16.6686 18.0974 43.3182 12.2189 1.0725 3.9276 7.4012 4.8944 86.4917 6.5535 78.3752 55.9274 41.1320 18.9586 11.5572 19.4043 0.0235 27.8176 23.1364 16.0177 33.3261 20.6669
temp: 298.150 k
press: 1.00000 atm
elementType: 8 7 7 6 6 6 6 6 6 6 6 6 6 6 1 1 1 1 1 1 1 1 1 1 1 1
symmnumber: 1
zpe: 547009.3 jmol-1
zpe.correction: 0.208345 hartree
zpe.thermalcorrener: 0.221256 hartree
zpe.thermalcorrenthalpy: 0.222200 hartree
zpe.thermalcorrgfe: 0.166288 hartree
zpe.sumelectzpe: -610.092090 hartree
zpe.sumelectthermal: -610.079179 hartree
zpe.sumelectthermalent: -610.078235 hartree
zpe.sumelectthermalfe: -610.134146 hartree
dipole: 1.6856 5.3865 0.5973
dipole: 5.6757
quadrupole: -76.9041 -76.1539 -87.7455
quadrupole: -13.5733 -3.5778 -2.8498
quadrupole: 3.3637 4.1139 -7.4776 -13.5733 -3.5778 -2.8498
hfenergy: -610.3004348 hartree
pointgroup: C01 [X(C11H12N2O1)]
dipole: -0.699354 -2.0875045 0.3733635 debye
dipolederiv: -0.4001012 -0.0257402 -0.1052107 -0.1425001 -0.7336172 0.0702587 -0.0494084 0.0462979 -0.5587431 -0.0883838 -0.2265476 0.0167968 -0.0911121 -0.487324 0.0039978 0.0037765 -0.0067331 -0.2255305 -0.2672205 -0.1155931 0.0147616 -0.1396175 -0.4536027 0.0001893 -0.0101551 -0.0199228 -0.2569795 -0.2197462 0.1728599 -0.0073189 -0.4866729 0.3175772 -0.0351899 0.035227 0.0040967 -0.0440319 0.0089673 0.0271491 -0.0094729 -0.0456418 0.3565255 -0.0060151 0.0082871 0.010736 0.0587192 -0.0219868 0.1238765 -0.0164436 0.6571638 -0.0330588 0.0765006 0.0249076 0.0535988 -0.1009202 0.6410191 -0.0646963 0.0386455 -0.1041996 -0.0233313 -0.0046068 0.0404985 -0.0010097 0.0341906 0.3381379 -0.0513116 0.0870863 -0.0043335 0.5002607 -0.0938398 0.006374 -0.0589861 0.4898097 0.0281365 -0.036607 0.0065879 0.0767236 0.02082 0.0052062 -0.0202449 0.0210094 0.1222231 -0.2400573 0.0999215 -0.0050099 0.2035836 -0.0275605 0.013645 -0.0086482 0.0052193 -0.1392984 -0.2056036 -0.0184012 -0.0008703 -0.1285639 0.0510818 -0.0110776 0.0015983 -0.0028379 -0.182563 0.0913603 -0.0917934 0.016095 -0.1086299 0.1422777 -0.0091998 0.0164631 -0.0088329 -0.1430921 0.0342208 0.0662178 0.011721 0.1797722 0.0607207 0.0097279 0.0102283 0.0022707 -0.1412738 -0.0698365 0.0060547 0.0077633 -0.0728135 -0.0672363 -0.0053877 0.007739 -0.000472 -0.173724 0.2211274 -0.0616309 -0.0049176 -0.0734695 0.1480602 -0.0023611 -0.0141322 -0.0120527 0.3191603 0.0001351 -0.0296479 -0.0436392 -0.1033722 -0.0348422 -0.0260488 -0.1051733 -0.0046228 -0.2072098 -0.0974108 0.0753503 0.037476 0.1264818 -0.0157988 -0.0173315 0.0821159 -0.0364499 0.0392656 -0.0846871 -0.0278863 0.0061468 -0.122556 0.0721457 0.008246 0.0157592 0.0004283 0.1149468 0.0443639 0.0292365 0.0338011 0.0959597 -0.0352519 0.0951206 -0.0344274 0.1407948 -0.0656941 0.0544871 0.0052128 -0.0532591 0.0828808 -0.0622547 -0.0950178 0.0195037 -0.1467424 -0.0243816 0.0806426 -0.0863552 -0.0048736 -0.0713636 0.0264257 -0.003347 -0.0047939 -0.003336 0.1521569 0.0466927 0.1138282 -0.0080316 0.0902283 -0.1068953 0.0076449 -0.0069632 0.0096387 0.1470674 0.0395695 0.0692139 -0.0079482 0.1010427 -0.0932133 0.0083757 -0.0086476 0.0065555 0.1548986 -0.0143243 -0.09198 -0.0106328 -0.1262146 -0.0470876 -0.0067266 -0.0107777 -0.0043282 0.1576451 -0.1343541 0.0295866 -0.0202341 0.027971 0.0872492 0.0024781 -0.0200149 0.0027866 0.1639261 0.2148519 0.1096829 0.020981 0.1792533 0.43793 0.0147587 0.0209087 0.0028938 0.3094326 unknown
polarizability: 225.4630842|-11.210551|141.9989361|10.5321049|-3.4464225|63.9077796 unknown
InChI: InChI=1S/C11H12N2O/c1-8-10(7-14)13-11(12-8)9-5-3-2-4-6-9/h2-6,12,14H,7H2,1H3
charge 0 multiplicity 1
26 atoms
O  3.304869 2.310583 -0.475457
N  0.827137 -1.459329 0.124046
N  1.064134 0.77334 0.119868
C  2.209761 -1.222022 0.202936
C  0.157566 -0.234187 0.069505
C  2.327961 0.173595 0.202991
C  -1.297569 -0.079121 -0.027646
C  3.537822 1.073275 0.274649
C  3.228267 -2.321023 0.270456
C  -1.848372 1.232149 -0.074435
C  -2.180656 -1.193878 -0.077939
C  -3.24085 1.419999 -0.169993
C  -3.574967 -1.001326 -0.173365
C  -4.112994 0.305624 -0.22021
H  0.393546 -2.380985 0.098542
H  3.770543 1.320391 1.333598
H  4.425627 0.584878 -0.165899
H  4.243415 -1.895524 0.208933
H  3.167573 -2.893134 1.216393
H  3.119899 -3.039855 -0.564085
H  -1.162955 2.084254 -0.033712
H  -1.793984 -2.220556 -0.043952
H  -3.649218 2.436042 -0.20526
H  -4.241689 -1.869991 -0.211348
H  -5.195821 0.453428 -0.294398
H  2.319555 2.463072 -0.448116
