program: Gaussian 09
title: 000083611
version: EM64L-G09RevD.01
frameworkgroup: C1[X(C9H12O2)]
method: RPBEPBE
basis: SDD
operation: Freq
keyword: #pfreq=noraman
keyword: PBEPBE/SDD
title: #p freq=noraman PBEPBE/SDD
converged: YES YES NO NO
title: Mulliken charges:
elementType: O O C C C C C C C C C H H H H H H H H H H H H
charge: -0.258605 -0.421657 0.371288 0.473575 -0.536498 -0.277860 -0.380586 -0.413775 -0.210640 -0.333621 -0.804352 0.256266 0.207694 0.200573 0.242398 0.230459 0.220150 0.181056 0.235811 0.227116 0.235989 0.222957 0.332264
chargesum: 0.00000
title: Mulliken charges with hydrogens summed into heavy atoms:
elementType: O O C C C C C C C C C
charge: -0.258605 -0.089393 0.371288 0.473575 -0.280232 0.130407 -0.138188 -0.183316 0.009510 0.083246 -0.118290
polarizability: 1.42358158e+02 4.31841152e+00 1.06393104e+02 -4.78448217e+00 3.28754505e+00 6.23031774e+01
1716.lowfreq: -39.8478 -14.9272 -0.0004 0.0007 0.0007 2.2372 8.1925 46.3254 58.3179
frequency: -39.4209 46.2745 58.2966 116.7655 147.2117 210.2744 224.2925 239.6433 288.7592 306.1552 427.9169 443.6745 462.2511 510.8798 562.7671 604.9849 693.0266 722.7931 775.0300 832.8886 859.7137 870.8468 891.0097 939.2749 963.5628 983.1670 998.0651 1018.2814 1044.7588 1046.5948 1082.5092 1100.1894 1154.7723 1168.2564 1183.1785 1252.8849 1256.3988 1297.0060 1319.8053 1370.0480 1386.8805 1393.4523 1396.0650 1435.1421 1454.6117 1465.7964 1472.7463 1473.9560 1481.8603 1589.0074 1623.0129 2926.3041 2950.5378 2976.8184 2988.5295 3058.8172 3087.2662 3091.6897 3123.1764 3142.9972 3148.4158 3163.9077 3559.3256
redmass: 1.0165 5.7122 3.1954 3.7007 2.0368 3.1088 2.7792 3.0887 2.5055 1.8363 3.5724 2.8724 3.0612 4.9989 3.6293 4.3751 2.0566 5.1472 1.4863 3.4169 1.6589 1.8856 1.4623 2.3184 1.3262 5.9308 1.6066 1.6378 2.2255 1.5987 2.8161 1.6312 1.8686 1.1792 1.1372 1.3067 2.7007 1.3302 1.2600 1.5779 2.0445 1.6824 1.2847 2.2056 1.0801 1.0890 1.2840 1.4365 1.5151 5.8702 6.6202 1.0566 1.0705 1.0385 1.1040 1.0951 1.0998 1.0928 1.0861 1.0928 1.0921 1.0970 1.0663
irintensity: 0.4766 0.3020 7.0214 6.5091 30.1930 1.9675 50.6789 46.9154 24.2557 52.0949 3.1650 6.2297 8.3722 0.1479 0.0982 12.5308 23.4705 8.3334 56.9396 4.1638 20.1187 13.2884 19.2161 47.8820 0.9819 0.4189 2.2219 75.3111 36.6763 30.8863 10.5816 11.7697 118.1415 22.1533 0.4382 9.4891 130.1226 1.9069 8.5976 9.5477 25.7577 20.0701 5.3370 17.1538 5.2546 37.0798 10.4754 9.9395 55.4757 52.9016 91.6256 24.1082 105.8920 32.6480 57.5745 23.4415 19.6583 20.0213 4.7062 33.2808 4.0931 14.6832 5.8962
temp: 298.150 k
press: 1.00000 atm
elementType: 8 8 6 6 6 6 6 6 6 6 6 1 1 1 1 1 1 1 1 1 1 1 1
symmnumber: 1
zpe: 495639.9 jmol-1
zpe.correction: 0.188779 hartree
zpe.thermalcorrener: 0.199445 hartree
zpe.thermalcorrenthalpy: 0.200389 hartree
zpe.thermalcorrgfe: 0.151723 hartree
zpe.sumelectzpe: -499.744098 hartree
zpe.sumelectthermal: -499.733432 hartree
zpe.sumelectthermalent: -499.732488 hartree
zpe.sumelectthermalfe: -499.781154 hartree
dipole: -0.2678 2.8075 0.3237
dipole: 2.8387
quadrupole: -61.5572 -63.8557 -65.6722
quadrupole: 11.8896 -0.1401 1.4781
quadrupole: 2.1379 -0.1607 -1.9771 11.8896 -0.1401 1.4781
hfenergy: -499.9328774 hartree
pointgroup: C01 [X(C9H12O2)]
dipole: -0.1281084 1.1064887 0.081397 debye
dipolederiv: -1.889521 -0.0293428 0.129346 0.0449743 -0.309939 -0.0093234 0.1722798 -0.0110233 -0.2895204 -0.7633283 0.0354716 -0.0845471 0.060999 -0.3324001 0.2723473 -0.1612493 0.3206063 -0.5172307 1.5464319 -0.1079663 -0.1186978 -0.42221 0.1565166 0.0352961 -0.1627412 0.0185906 0.1255364 0.3275655 0.1025416 -0.0384798 0.165216 0.3147964 -0.008665 -0.0839095 -0.0457267 -0.0187763 -0.5160064 -0.0520328 0.0246632 -0.2025145 -0.0128758 0.0238672 0.0179051 0.017185 -0.2006854 0.7834719 0.1909123 -0.0547841 0.6142796 0.2719157 0.0294122 0.0066006 -0.003912 0.346626 -0.3364098 -0.0198537 0.004736 0.3338787 -0.1383255 -0.0163568 0.0306616 0.0061479 -0.2382797 -0.0981468 -0.0957768 -0.0239669 -0.1341595 -0.2921165 0.0122436 -0.0184532 0.0130694 -0.2123016 0.2029927 0.0773173 -0.0198352 -0.0301892 0.15693 0.0142933 -0.022237 0.0126312 -0.1266715 0.4423449 -0.030842 0.0854015 -0.0446516 0.3874054 -0.2151964 0.1204794 -0.2288091 0.5278422 -0.0241354 -0.1066492 0.0133576 -0.1163096 -0.0480772 0.0133094 0.088117 0.0752557 0.062352 0.0935846 0.0398664 0.0063171 0.045078 -0.0508968 -0.0180782 0.006626 -0.0220802 0.1612837 -0.0406293 0.0444624 -0.0524387 -0.1147274 -0.0569519 0.1201469 0.0030342 0.1262273 -0.0742938 -0.0355649 0.0088819 0.0127991 -0.1420317 -0.0275519 -0.0843297 -0.0398612 -0.12095 -0.1236276 -0.0168789 -0.1095368 0.0119906 -0.1198814 0.0048011 -0.0010988 0.009986 -0.0006833 0.1699953 -0.1288171 0.0463605 0.0272941 0.0291493 0.0798097 -0.0106996 0.0210426 -0.0119524 0.1613041 0.056364 0.0521884 0.0099687 0.0631148 -0.1206637 -0.0212095 0.0089467 -0.0210446 0.1498639 -0.1385535 -0.1041274 0.0394687 -0.1216688 -0.121309 0.1257683 -0.0090761 0.0711772 0.0118463 0.1072382 -0.0071064 -0.0336916 0.0437715 0.0087508 -0.092392 -0.0219279 -0.0418239 -0.064711 0.0514099 0.0735768 0.0610965 -0.0033498 -0.0718342 -0.0934856 0.0027195 -0.1222537 0.0428798 0.0499921 -0.0583952 0.0224414 -0.0718241 0.0333816 0.0570031 0.0617503 0.0928932 -0.1028003 -0.1157525 0.0086454 -0.0740499 0.0922082 0.0453289 0.0427596 -0.0914542 0.0024815 0.0796363 0.4423482 0.041405 0.0516106 0.0308481 0.1233052 -0.1756119 0.0607606 -0.1260061 0.1297323 unknown
polarizability: 142.067209|4.8778121|106.7834432|-5.7405883|1.2485889|62.2037878 unknown
InChI: InChI=1S/C9H12O2/c1-8-3-2-4-9(7-8)11-6-5-10/h2-4,7,10H,5-6H2,1H3
charge 0 multiplicity 1
23 atoms
O  1.322783 -0.365472 -0.363834
O  4.10516 -0.908162 0.608297
C  -0.003563 0.079067 -0.209669
C  -2.350253 -0.636287 -0.045021
C  -0.979996 -0.946479 -0.187353
C  2.381774 0.647136 -0.369684
C  -0.385261 1.438227 -0.090402
C  -2.73439 0.728332 0.070101
C  -1.759115 1.746251 0.049115
C  3.725099 -0.065928 -0.527026
C  -3.390396 -1.742756 0.009731
H  -0.64294 -1.984342 -0.283032
H  2.234114 1.346753 -1.220756
H  2.351546 1.236221 0.574067
H  0.352142 2.246169 -0.110533
H  -3.79455 0.98623 0.174962
H  -2.064474 2.795272 0.13686
H  4.501689 0.70525 -0.72924
H  3.680906 -0.756346 -1.384855
H  -3.075559 -2.625593 -0.573749
H  -3.556224 -2.078901 1.051745
H  -4.363702 -1.400576 -0.38386
H  4.03051 -0.385966 1.446938
