program: Gaussian 09
title: 000008125
version: EM64L-G09RevD.01
frameworkgroup: C1[X(C8H16)]
method: RPBEPBE
basis: SDD
operation: Freq
keyword: #p
keyword: freq=noraman
keyword: PBEPBE/SDD
title: #p freq=noraman PBEPBE/SDD
converged: YES YES NO NO
title: Mulliken charges:
elementType: C C C C C C C C H H H H H H H H H H H H H H H H
charge: -0.359950 -0.352433 -0.377588 -0.354403 -0.455240 -0.695203 -0.033360 -0.598365 0.185762 0.191800 0.186885 0.189639 0.192655 0.210891 0.194487 0.195071 0.197323 0.204976 0.209682 0.209997 0.215277 0.211595 0.213448 0.217053
chargesum: 0.00000
title: Mulliken charges with hydrogens summed into heavy atoms:
elementType: C C C C C C C C
charge: 0.017612 0.024092 0.025957 0.035156 -0.052941 -0.060247 0.178235 -0.167864
polarizability: 1.16932373e+02 -2.55479420e+00 7.18151181e+01 8.42974193e+00 2.37946598e+00 7.41012484e+01
1716.lowfreq: -9.1709 -0.0003 -0.0003 -0.0002 4.9348 21.9513 46.9765 59.1704 77.8954
frequency: 46.7647 58.4070 77.8741 101.7587 126.1404 138.9557 221.6598 225.4603 272.6410 364.2413 434.6459 459.3094 636.1260 721.7160 736.2615 787.1417 872.5553 885.0469 921.6177 939.5711 967.1097 1003.8965 1005.4734 1025.1691 1043.9521 1067.3984 1079.1342 1114.1520 1173.8265 1198.5593 1225.9839 1244.0671 1271.5270 1276.6439 1286.0834 1289.0533 1295.3644 1319.2422 1345.9927 1353.6645 1388.8908 1423.7544 1457.7643 1462.7562 1465.6070 1473.6898 1476.4542 1481.9137 1488.7365 1657.0390 2950.2273 2952.0491 2955.5417 2965.8441 2970.0916 2972.1113 2987.8661 3001.8358 3014.0679 3029.0228 3044.5464 3068.4771 3070.1526 3070.9604 3088.8404 3192.2091
redmass: 3.1304 1.8923 2.4665 2.6480 1.7832 2.1877 2.3480 1.1383 3.6813 2.3747 2.2684 2.5584 1.5243 1.0644 1.1063 1.1879 1.2329 1.9124 1.8472 1.3317 1.3156 1.1585 2.3837 3.3056 1.4820 2.4514 2.2307 2.3221 2.0641 1.5866 1.2970 1.3172 1.2215 1.1717 1.1313 1.1457 1.1465 1.3789 1.5083 1.6639 1.2169 1.1795 1.0927 1.0675 1.0775 1.0741 1.0428 1.0811 1.0908 4.7804 1.0614 1.0599 1.0589 1.0602 1.0598 1.0365 1.0966 1.0985 1.0986 1.1030 1.1032 1.1003 1.0795 1.0992 1.0743 1.1145
irintensity: 0.0467 0.0079 0.0469 0.0246 0.0133 0.0445 0.0483 0.0018 0.0348 0.8113 1.1325 0.3949 16.4649 12.2991 0.5921 2.9465 2.8659 4.6874 2.0463 80.0219 4.7958 13.7992 0.6484 2.6184 8.7658 1.8876 0.0700 10.8586 1.6563 1.3403 2.9909 0.1917 0.2734 0.1495 0.1041 0.7965 0.3837 0.3721 0.8451 0.6578 11.1195 3.6147 3.7046 0.0520 1.4922 1.7715 12.4560 3.4904 23.9697 21.4599 8.7923 10.3125 7.7661 0.9283 156.7308 37.8976 2.0077 2.5120 3.3548 8.4214 108.7645 81.3229 64.5813 54.5243 7.2441 33.3673
temp: 298.150 k
press: 1.00000 atm
elementType: 6 6 6 6 6 6 6 6 1 1 1 1 1 1 1 1 1 1 1 1 1 1 1 1
symmnumber: 1
zpe: 572560.5 jmol-1
zpe.correction: 0.218077 hartree
zpe.thermalcorrener: 0.228916 hartree
zpe.thermalcorrenthalpy: 0.229860 hartree
zpe.thermalcorrgfe: 0.180947 hartree
zpe.sumelectzpe: -313.754119 hartree
zpe.sumelectthermal: -313.743279 hartree
zpe.sumelectthermalent: -313.742335 hartree
zpe.sumelectthermalfe: -313.791249 hartree
dipole: -0.5377 0.0877 -0.1571
dipole: 0.5670
quadrupole: -55.7394 -53.3079 -51.2961
quadrupole: -1.0118 0.2755 1.3978
quadrupole: -2.2917 0.1399 2.1517 -1.0118 0.2755 1.3978
hfenergy: -313.9721955 hartree
pointgroup: C01 [X(C8H16)]
dipole: 0.2115134 0.0544414 0.0453214 debye
dipolederiv: -0.0611865 0.0094748 0.0052595 0.0456622 0.1142211 0.0416484 -0.0129146 0.0347523 0.1701062 -0.0682891 0.0015882 0.0070059 -0.0540475 0.0853081 0.0300461 0.0298824 0.0350043 0.172 0.0086029 -0.0069389 0.0091135 -0.062828 0.0697783 0.0109573 0.0562394 0.0371882 0.1840049 0.0255231 0.0083234 0.0025149 0.066992 0.1108128 0.026763 -0.0194873 0.0251564 0.1652751 -0.1682442 -0.044522 0.0052423 -0.0699579 0.1301081 0.0566879 -0.0052952 0.0338709 0.1223288 -0.0810933 0.0481662 -0.0120857 0.0112642 0.0546378 0.0130445 0.0041384 0.0134213 0.0914434 0.2179675 0.1780792 0.0491033 0.3167007 -0.1002581 -0.0693972 -0.051162 -0.0983923 0.1363805 -0.2788589 0.1317252 -0.0416784 0.09689 -0.3233301 -0.1462965 -0.0700851 -0.1551566 0.0192775 0.0349925 -0.0084344 -0.0026625 -0.0077133 -0.1409399 -0.0990164 -0.003975 -0.1259709 -0.0017633 0.0379935 0.0037904 -0.0079004 0.0008703 0.0327571 0.0673046 -0.0010841 0.0936717 -0.1685858 0.0368165 0.0002332 0.000311 0.0042905 0.0336031 0.0695534 -0.0076778 0.0953555 -0.174263 0.0373703 -0.0156574 -0.0051309 -0.0038753 -0.1373083 -0.0985868 -0.0037941 -0.1239194 0.0002754 0.0467825 0.0089578 -0.004149 -0.0028165 0.0350055 0.0649366 -0.0001444 0.0939366 -0.1686335 0.0383385 -0.0001264 0.0005271 0.0033984 -0.1200366 -0.0899952 -0.0002363 -0.1133388 0.0056039 0.0298843 0.0208934 0.0102665 -0.0115976 -0.1469764 -0.1038264 -0.0042653 -0.1331426 0.0053088 0.0277227 0.0174362 -0.0352952 -0.0001067 0.0380156 0.0748212 -0.0016277 0.1020638 -0.1765242 0.0247306 -0.0600884 -0.0296295 -0.0425469 -0.1188515 -0.0999588 0.0179548 -0.1163397 0.0231343 0.0264317 0.0047946 -0.0171346 0.0068354 0.051199 0.045215 0.004349 0.0919114 -0.1521411 0.080277 0.0106558 0.0139878 0.037741 0.059325 0.0631393 -0.048935 0.0823256 -0.1685733 0.0803959 -0.0186003 -0.0263421 0.0452824 -0.1163574 -0.1139019 0.0006249 -0.1294126 0.0077883 -0.1894398 -0.0850591 0.0443839 -0.1182266 0.0229007 0.0351497 0.0594631 0.0336267 0.0836261 0.0592719 -0.0324962 -0.0246202 -0.07093 0.1006032 0.0759433 0.0313195 0.0882692 -0.1324082 -0.0658759 -0.1216451 0.037719 -0.1537853 0.1243627 0.0549047 0.0409379 0.0610381 0.0609154 0.0998863 -0.0505503 0.0211938 -0.0374956 0.1414201 0.0908642 -0.0142256 0.0740811 -0.1045764 unknown
polarizability: 116.9149079|5.3932462|70.4729591|7.0085484|-0.9471388|75.4608721 unknown
InChI: InChI=1S/C8H16/c1-3-5-7-8-6-4-2/h3H,1,4-8H2,2H3
charge 0 multiplicity 1
24 atoms
C  0.610778 0.494773 -0.133582
C  1.884782 -0.342139 0.119644
C  -0.693053 -0.254895 0.221397
C  3.18968 0.410282 -0.228947
C  -1.966248 0.598278 -0.028071
C  4.458464 -0.429762 0.032687
C  -3.238074 -0.106403 0.393867
C  -4.296599 -0.375479 -0.411753
H  0.664868 1.433409 0.457386
H  0.579088 0.801339 -1.200157
H  1.915563 -0.651325 1.185646
H  1.83434 -1.279248 -0.473403
H  -0.661989 -0.561646 1.287742
H  -0.760878 -1.189404 -0.370615
H  3.236858 1.34827 0.361328
H  3.159858 0.715629 -1.29497
H  -1.864719 1.546952 0.54201
H  -2.026559 0.875354 -1.098715
H  4.529285 -0.71936 1.098279
H  4.448174 -1.360182 -0.566187
H  5.37652 0.128785 -0.227337
H  -3.278167 -0.42372 1.448967
H  -5.187121 -0.895167 -0.040019
H  -4.301051 -0.082143 -1.469298
