program: Gaussian 09
title: 000083529
version: EM64L-G09RevD.01
frameworkgroup: C1[X(C9H15ClO)]
method: RPBEPBE
basis: SDD
operation: Freq
keyword: #p
keyword: freq=noraman
keyword: PBEPBE/SDD
title: #p freq=noraman PBEPBE/SDD
converged: YES YES NO NO
title: Mulliken charges:
elementType: Cl O C C C C C C C C C H H H H H H H H H H H H H H H
charge: -0.076304 -0.208878 -0.118285 -0.437830 -0.438558 -0.391375 -0.397789 -0.387266 0.165322 -0.460186 -0.582269 0.209678 0.221603 0.201848 0.204334 0.228607 0.206547 0.193469 0.192112 0.205146 0.203457 0.195683 0.256484 0.256873 0.274789 0.282788
chargesum: 0.00000
title: Mulliken charges with hydrogens summed into heavy atoms:
elementType: Cl O C C C C C C C C C
charge: -0.076304 -0.208878 0.091393 -0.014380 -0.005616 0.008641 -0.000531 0.011874 0.165322 0.053171 -0.024692
polarizability: 1.32580358e+02 -2.77162817e+00 9.33165999e+01 2.83542612e+00 -4.06609054e+00 8.70184161e+01
1716.lowfreq: -21.4762 -13.7161 -0.0028 -0.0019 -0.0019 11.6390 13.6103 67.1505 68.9425
frequency: -11.7191 66.9945 68.9151 77.6904 141.1280 184.0978 212.8864 220.9430 273.7345 307.6610 355.8747 427.1275 448.2557 497.8838 556.0502 620.1463 731.7324 773.3701 784.8510 786.8159 836.0674 875.6699 883.4157 889.9201 915.3817 979.4618 990.8274 1037.6744 1049.6916 1054.7541 1069.1550 1103.2553 1111.1860 1116.4001 1144.0473 1179.2856 1234.2842 1250.5094 1254.3852 1262.6401 1264.5641 1291.1385 1307.4319 1319.7187 1326.8239 1336.6201 1342.7386 1347.9609 1357.4602 1435.4017 1458.1599 1460.4203 1461.5907 1463.4189 1469.3129 1476.3640 1615.4283 2964.5096 2966.2204 2967.7058 2971.4591 2975.9272 2984.1938 2987.7386 3026.9056 3031.3402 3032.3950 3035.5355 3042.7803 3053.6818 3078.3476 3161.4081
redmass: 4.6783 3.7286 2.4139 3.6255 3.5794 3.6419 2.3954 3.6470 2.7011 5.4550 1.9228 3.0190 3.2027 1.5135 2.2312 7.4106 3.6065 1.5593 1.4840 2.0910 2.4121 1.8895 1.9161 2.5307 1.6070 1.7932 2.6952 2.1817 2.1404 1.4814 1.2523 2.0338 2.3735 1.2007 2.3410 1.4591 1.3014 1.3112 1.3003 1.2121 1.2153 1.2300 1.2883 1.3196 1.5628 1.3666 1.4818 1.5867 1.5404 1.1069 1.0954 1.0866 1.0867 1.0868 1.0832 1.0923 7.9272 1.0700 1.0699 1.0670 1.0630 1.0614 1.0620 1.0616 1.0982 1.0941 1.0981 1.1030 1.1036 1.1024 1.0574 1.1110
irintensity: 0.1121 0.1188 2.3727 6.7578 4.9985 2.9939 0.2882 0.0308 6.8906 0.2296 3.1097 0.2341 1.2658 1.6596 0.3530 54.1419 8.7751 7.1217 1.9636 2.9205 8.4798 0.2468 7.6298 3.2349 3.7550 3.5009 26.1882 3.0208 0.2230 1.9939 0.8512 18.9828 0.0394 3.6291 30.8413 2.8926 2.5105 12.9168 0.4145 2.0114 1.8182 13.3515 7.0715 5.2525 89.8322 0.3566 3.4054 17.4639 22.5650 20.9775 8.8614 2.2316 9.7043 12.1620 20.5807 4.2125 90.8210 24.6623 15.5623 46.6591 26.9201 32.2322 16.3611 23.2229 74.7982 48.7223 8.9852 16.2571 30.9906 90.8831 9.7358 8.7470
temp: 298.150 k
press: 1.00000 atm
elementType: 17 8 6 6 6 6 6 6 6 6 6 1 1 1 1 1 1 1 1 1 1 1 1 1 1 1
symmnumber: 1
zpe: 584907.3 jmol-1
zpe.correction: 0.222779 hartree
zpe.thermalcorrener: 0.233775 hartree
zpe.thermalcorrenthalpy: 0.234719 hartree
zpe.thermalcorrgfe: 0.185019 hartree
zpe.sumelectzpe: -886.365267 hartree
zpe.sumelectthermal: -886.354272 hartree
zpe.sumelectthermalent: -886.353328 hartree
zpe.sumelectthermalfe: -886.403028 hartree
dipole: 2.9704 1.2392 -1.1650
dipole: 3.4229
quadrupole: -84.0852 -76.5903 -75.4345
quadrupole: 2.3807 -1.6525 3.7161
quadrupole: -5.3819 2.1130 3.2689 2.3807 -1.6525 3.7161
hfenergy: -886.5880465 hartree
pointgroup: C01 [X(C9H15Cl1O1)]
dipole: -1.2030777 0.4349269 0.4206968 debye
dipolederiv: -0.5960852 -0.0971894 -0.0826288 -0.1685141 -0.2338724 -0.0463852 -0.1599292 -0.0516838 -0.23394 -0.7248825 0.0345502 0.033861 0.0807675 -0.5499721 -0.2310292 0.1349511 -0.2807151 -0.536776 -0.5357765 0.1358888 0.0703776 0.1655543 -0.089992 0.01232 -0.0285251 0.0579847 0.1101217 0.0182728 0.0227903 0.0346679 -0.091382 0.1440943 0.0215537 0.1874941 -0.0664657 0.1020696 0.0498833 0.0063773 0.0006738 0.1308574 0.0842989 -0.0352903 0.0482342 -0.0019554 0.090586 0.0697079 -0.0150868 0.0191861 0.0267801 0.0577738 0.0188235 -0.0779504 0.0818896 0.144223 0.0464795 0.0236671 0.0144741 -0.0529369 0.0684225 0.0652212 -0.0209426 0.0331663 0.1475656 0.074376 -0.0102973 -0.01337 0.0138316 0.0556081 0.041664 0.0318843 0.0351608 0.1231041 1.3154072 -0.0508194 0.0483487 -0.0237589 0.4763073 0.3976384 -0.0235612 0.4417287 0.4747172 -0.4127001 -0.1150477 -0.1102772 -0.2433424 -0.0440208 -0.1826712 -0.2794648 -0.2053283 -0.1255146 0.6741006 0.1789857 0.1828331 0.198009 0.2607259 0.0637609 0.1924595 0.0674408 0.2614966 0.0492745 -0.0184008 -0.0233094 -0.0542786 -0.0016774 -0.0746907 -0.0436068 -0.0738913 -0.1248429 0.0475396 0.0277535 -0.0226204 0.0258846 0.0240603 -0.1035206 -0.0140418 -0.0417892 -0.1001751 -0.0748589 -0.136396 0.0267207 -0.1292133 -0.0944103 0.0442758 0.0041303 0.0129008 0.0622537 -0.0011684 0.0779249 -0.0628954 0.0435085 -0.0696653 0.1078388 -0.0539246 0.1312576 -0.023215 0.0613134 -0.0139952 0.0026661 -0.0237409 0.0474631 -0.0456063 -0.0109973 -0.1007513 -0.0794851 -0.0306936 0.0816886 -0.0439043 0.0803687 -0.0907749 0.1132697 -0.0482927 0.1408216 -0.0247101 0.0239671 -0.0368833 -0.0190292 -0.022562 0.0173469 -0.0774743 0.0160146 -0.1453935 -0.1324449 0.0453873 0.0157788 -0.047059 0.046784 0.0242225 -0.1127936 0.0036477 -0.0560358 -0.1651087 -0.0954509 -0.1231437 0.0327708 -0.1343313 -0.113505 0.0460731 0.0137079 0.0191449 0.070468 -0.2114187 0.0697533 0.0537366 0.0843742 0.0239662 -0.0029826 0.0881879 -0.0097133 0.0545786 0.0848645 -0.0109571 0.0001623 -0.0436213 -0.0096766 -0.0784651 -0.0663798 -0.0664611 -0.1528482 0.0590519 0.0513639 -0.0148605 0.0873064 -0.0603109 -0.0084953 0.0607679 0.0176754 0.1069704 0.0571979 -0.0314193 0.017974 0.0196398 0.0899278 0.0538102 0.0745259 0.0424217 -0.0453778 0.0037422 -0.0395067 -0.0539326 -0.0373515 0.0561651 0.0306877 -0.0039997 0.0291176 -0.0773261 0.0024692 -0.0273795 -0.0445663 0.0213672 -0.072505 -0.0175329 -0.0243893 -0.0105267 0.07361 unknown
polarizability: 132.0365639|3.8667051|93.3347484|4.6411067|4.4876759|87.5440621 unknown
InChI: InChI=1S/C9H15ClO/c10-7-6-9(11)8-4-2-1-3-5-8/h8H,1-7H2
charge 0 multiplicity 1
26 atoms
Cl 4.815687 0.704821 0.667653
O  0.996487 -1.291083 -1.134042
C  -0.524578 -0.017054 0.294807
C  -1.093445 1.06784 -0.678838
C  -1.503956 -1.215854 0.398029
C  -2.504917 1.523553 -0.241553
C  -2.917543 -0.756772 0.823527
C  -3.476353 0.324902 -0.130571
C  0.855733 -0.448078 -0.204772
C  2.067227 0.219167 0.455691
C  3.382851 -0.142939 -0.229846
H  -0.411061 0.453994 1.294117
H  -1.139514 0.631457 -1.696323
H  -0.409369 1.938383 -0.725919
H  -1.111562 -1.959615 1.118595
H  -1.5439 -1.7185 -0.58724
H  -2.892744 2.267449 -0.964226
H  -2.43918 2.035069 0.741083
H  -2.879307 -0.348512 1.855124
H  -3.598064 -1.629505 0.852442
H  -4.468322 0.669612 0.219509
H  -3.62537 -0.11778 -1.136953
H  1.916319 1.316953 0.464231
H  2.091524 -0.085144 1.521934
H  3.428375 0.209206 -1.269568
H  3.594881 -1.219668 -0.19029
