program: Gaussian 09
title: 000008119
version: EM64L-G09RevD.01
frameworkgroup: C1[X(C6H13N)]
method: RPBEPBE
basis: SDD
operation: Freq
keyword: #pfreq=noraman
keyword: PBEPBE/SDD
title: #p freq=noraman PBEPBE/SDD
converged: YES YES NO NO
title: Mulliken charges:
elementType: N C C C C C C H H H H H H H H H H H H H
charge: -0.316112 -0.391870 -0.345770 -0.330603 -0.400105 -0.399720 -0.399740 0.181550 0.197986 0.206060 0.181787 0.175723 0.199223 0.204642 0.196899 0.188034 0.198513 0.207962 0.181370 0.264172
chargesum: 0.00000
title: Mulliken charges with hydrogens summed into heavy atoms:
elementType: N C C C C C C
charge: -0.051940 -0.012335 0.042077 0.044342 0.001437 -0.013173 -0.010408
polarizability: 7.54830342e+01 1.36117579e+00 7.18118662e+01 -6.53423302e-01 3.81180436e-01 6.00138559e+01
1716.lowfreq: -16.3307 -12.3414 -0.0011 -0.0010 -0.0003 8.4879 120.9812 176.0332 269.1297
frequency: 120.7744 176.0119 269.1202 295.9951 314.8195 396.5393 425.6819 479.6261 587.8902 736.8626 804.5153 814.7615 848.7054 876.2480 898.1480 964.6434 1010.1621 1025.3028 1043.7270 1103.7232 1132.8999 1168.4960 1192.1592 1210.4214 1231.2224 1238.1795 1272.2759 1289.5640 1330.4722 1334.6490 1343.5636 1349.8598 1356.4423 1376.0616 1442.4996 1454.9065 1458.1685 1462.1147 1465.4015 1478.8415 1490.3201 2844.2522 2894.5652 2948.4396 2963.8144 2970.3606 2976.0896 2981.0233 3007.8145 3013.1809 3030.4256 3033.0927 3042.4837 3505.6441
redmass: 2.0125 1.9959 1.9625 2.1067 2.2235 2.6358 1.4760 1.4854 1.8662 2.4999 1.5183 1.8193 2.7895 1.9819 1.6985 2.1795 1.3981 2.0491 1.9988 1.8540 1.9933 1.2237 2.4265 1.4294 1.4928 1.1747 1.1713 1.1452 1.2485 1.3514 1.3712 1.4453 1.4346 1.3637 1.0992 1.1716 1.0936 1.0929 1.1747 1.0778 1.0909 1.0719 1.0690 1.0609 1.0634 1.0623 1.0760 1.0750 1.0971 1.0913 1.0995 1.1003 1.1007 1.0759
irintensity: 1.6774 0.5134 1.9898 11.3624 19.4472 4.4218 81.1217 1.3909 14.8795 1.3541 4.3329 7.3855 4.3039 3.0377 3.0438 6.6918 1.8576 3.3808 3.8282 1.2265 1.4146 5.2725 22.7394 0.5021 14.7995 2.0194 1.4564 1.8507 21.5656 4.4658 1.2047 1.4211 2.9731 1.8457 9.7059 7.3641 4.8341 10.7995 1.6028 17.3686 3.0377 149.5344 79.0602 25.6878 63.9273 33.6732 34.8804 36.9915 63.3423 82.1237 39.0166 26.6047 124.3142 0.2967
temp: 298.150 k
press: 1.00000 atm
elementType: 7 6 6 6 6 6 6 1 1 1 1 1 1 1 1 1 1 1 1 1
symmnumber: 1
zpe: 481395.0 jmol-1
zpe.correction: 0.183354 hartree
zpe.thermalcorrener: 0.190591 hartree
zpe.thermalcorrenthalpy: 0.191535 hartree
zpe.thermalcorrgfe: 0.152545 hartree
zpe.sumelectzpe: -290.579034 hartree
zpe.sumelectthermal: -290.571796 hartree
zpe.sumelectthermalent: -290.570852 hartree
zpe.sumelectthermalfe: -290.609842 hartree
dipole: 0.4806 -0.4743 0.5236
dipole: 0.8545
quadrupole: -43.8815 -42.4957 -46.1015
quadrupole: -0.7186 -0.5409 0.0890
quadrupole: 0.2780 1.6639 -1.9419 -0.7186 -0.5409 0.0890
hfenergy: -290.7623874 hartree
pointgroup: C01 [X(C6H13N1)]
dipole: 0.2185999 0.1452041 -0.2101131 debye
dipolederiv: -0.5501412 0.1261879 0.092373 0.2474882 -0.4475908 0.0282829 0.0027878 0.0051533 -0.6160594 0.0808912 0.0109386 0.0060911 -0.0005844 0.0604637 0.0170906 0.0100903 0.0275109 0.1618985 0.0459482 0.0320756 0.0054193 0.0296976 0.0961483 0.0119057 0.0137352 0.0016403 0.0886279 0.0078263 -0.0354956 0.0224216 -0.053654 0.0621485 -0.0071711 0.0627446 0.0245773 0.1111235 0.0221782 -0.0472184 0.0194443 -0.0213625 0.0524065 -0.029283 0.0356054 -0.0173656 0.1034937 0.5296377 -0.0994352 0.1115822 -0.0497287 0.1684289 -0.0266784 0.0936225 -0.0861599 0.3816933 0.3233097 -0.1325741 -0.1423972 -0.2624959 0.4634951 0.0404929 -0.1639594 0.0353925 0.3530466 0.0621561 0.013502 -0.008597 0.0059792 0.0020515 -0.0377237 -0.0779567 -0.0585055 -0.1986879 -0.1922392 -0.0534258 0.0931879 -0.0575845 0.0125896 0.0249723 0.1230085 0.0395556 0.0305374 0.0242652 0.0229295 -0.0494788 0.0163794 0.0910956 -0.0659591 -0.0304648 -0.0113865 -0.1556402 -0.0220451 -0.0869831 0.0132111 -0.0873718 -0.2225892 0.0207058 0.0015753 -0.0200904 0.0758992 -0.1315085 0.1207171 -0.0774111 0.1127857 -0.0629448 0.0654794 -0.1155546 0.0968704 0.025153 0.0616841 -0.0308734 0.002678 -0.0189077 0.022197 -0.0339993 0.0503148 -0.0802111 -0.1647205 -0.0405822 0.1214375 0.0113463 0.1162186 -0.1517074 -0.0226716 0.0008565 0.0088666 0.0883342 0.0177788 -0.0336449 -0.0783421 -0.023776 0.0639162 0.0610633 -0.046048 0.0194969 -0.1651645 -0.0392681 0.0307747 0.0177765 0.0159471 0.0739312 -0.0916167 -0.0175339 0.0184419 -0.260651 0.0090715 -0.0265906 -0.0192034 -0.0058247 -0.2331184 0.0212932 -0.0192582 -0.0311908 0.0796454 -0.0479652 0.071481 -0.0825094 0.0848397 -0.0173394 0.0612407 -0.1481157 0.0539935 -0.1028875 -0.1859427 0.0405808 0.1542456 -0.0004029 -0.0431702 0.0165198 0.2564514 -0.0553396 -0.1404842 0.0249451 -0.0443837 -0.091838 -0.0476424 0.009588 -0.0539436 -0.0319011 0.0287502 0.3048426 unknown
polarizability: 74.8629192|-1.9342814|72.4503961|0.5749208|0.1267588|59.995441 unknown
InChI: InChI=1S/C6H13N/c1-2-4-6-7-5-3-1/h7H,1-6H2
charge 0 multiplicity 1
20 atoms
N  1.113076 0.986014 0.38394
C  -1.660583 -0.474715 -0.110057
C  -0.554833 -1.434637 0.403112
C  -1.379007 1.032271 0.096439
C  0.743904 -1.372291 -0.441736
C  -0.002145 1.518672 -0.423678
C  1.75633 -0.280804 -0.009995
H  -1.81516 -0.673183 -1.192178
H  -2.619136 -0.722529 0.389938
H  -0.322565 -1.209115 1.462014
H  -0.953505 -2.468583 0.369808
H  -2.182113 1.616452 -0.401272
H  -1.418667 1.270768 1.177136
H  1.274033 -2.344313 -0.402056
H  0.462744 -1.2218 -1.503434
H  0.1015 1.273219 -1.507447
H  0.021847 2.623918 -0.353095
H  2.327152 -0.646842 0.868012
H  2.494324 -0.159868 -0.844112
H  1.785506 1.698064 0.681562
