program: Gaussian 09
title: 000083525
version: EM64L-G09RevD.01
frameworkgroup: C1[X(C8H14N2O3)]
method: RPBEPBE
basis: SDD
operation: Freq
keyword: #p
keyword: freq=noraman
keyword: PBEPBE/SDD
title: #p freq=noraman PBEPBE/SDD
converged: YES YES NO NO
title: Mulliken charges:
elementType: O O O N N C C C C C C C C H H H H H H H H H H H H H H
charge: -0.291524 -0.410924 -0.227691 -0.166735 -0.599496 -0.138552 -0.476173 -0.471503 -0.376501 0.228764 0.189312 -0.181835 -0.690588 0.313469 0.240213 0.248051 0.246692 0.234805 0.240829 0.234517 0.233303 0.241374 0.216505 0.213944 0.308064 0.262456 0.379225
chargesum: 0.00000
title: Mulliken charges with hydrogens summed into heavy atoms:
elementType: O O O N N C C C C C C C C
charge: -0.291524 -0.031699 -0.227691 -0.166735 -0.028976 0.174917 0.012091 0.009994 0.098845 0.228764 0.189312 0.051468 -0.018765
polarizability: 1.21859386e+02 1.48657915e+00 1.05253697e+02 -3.76459214e+00 4.29395063e+00 9.10485943e+01
1716.lowfreq: -14.2003 -6.3805 -0.0009 -0.0007 0.0007 3.7065 41.1228 46.9925 60.9298
frequency: 40.9492 46.9589 60.8874 77.7130 124.4492 138.6211 179.4494 236.2779 242.5438 257.4792 285.9961 309.6287 319.8933 335.7624 387.2946 438.6530 518.5322 553.8226 587.8091 623.3521 636.2381 685.2218 706.9173 712.7029 782.8417 822.7124 868.5998 880.2268 907.2566 919.3330 957.2255 990.8525 1008.9999 1046.3624 1048.3706 1062.4460 1099.5546 1146.9059 1151.3541 1165.2811 1187.1826 1192.3179 1234.5252 1251.4164 1262.5309 1300.0627 1302.0905 1325.5904 1332.2435 1338.8102 1360.9472 1373.8494 1417.1481 1464.0336 1471.0999 1473.0775 1476.2610 1491.1784 1563.1423 1631.5563 1665.9371 2972.7070 2977.6506 2983.7091 3022.1994 3023.8984 3056.2249 3067.3958 3069.7593 3089.0058 3089.5436 3102.2425 3440.8201 3516.2686 3581.8884
redmass: 4.3428 6.3700 4.7592 5.4243 3.4461 3.3895 2.6337 3.0708 1.1397 2.0638 1.2591 3.1230 3.8718 5.6282 6.1707 2.5377 3.8209 2.1927 1.9177 2.0226 1.4411 3.6452 4.5480 3.8435 2.6445 4.3729 1.8895 2.2305 1.5880 2.5379 2.8722 1.8391 1.6780 2.6463 2.5930 1.7728 1.8352 1.4173 1.3471 1.5161 2.3342 2.6222 1.2778 1.6131 1.6680 1.3756 1.3035 1.3226 1.4712 1.6825 1.6580 1.2363 2.8794 1.0520 1.0848 1.1007 1.1037 1.0928 3.3831 1.3509 8.6067 1.0377 1.0679 1.0778 1.0625 1.0643 1.0983 1.0995 1.0860 1.1022 1.1007 1.1051 1.0457 1.0641 1.0967
irintensity: 0.8876 3.7432 2.3990 2.9357 1.5383 0.3165 1.8378 4.9672 1.2094 3.6022 58.6597 7.9104 7.3034 3.6796 19.7176 5.7335 29.9642 22.4926 62.4494 65.3902 241.9569 36.6256 11.4145 14.0696 1.9694 17.1686 3.9264 5.8326 13.5598 6.2015 1.3949 2.2995 14.7592 292.7126 10.0554 14.1828 9.4027 8.5280 11.0415 5.1009 7.9951 21.7080 6.7001 19.6543 8.5763 6.5688 5.1328 3.1371 18.3880 84.9943 25.5858 9.1135 104.8026 15.4931 9.9396 26.6747 9.0277 2.8804 314.0673 16.9859 170.0693 26.9679 18.3791 69.9654 21.3306 20.4589 21.6942 50.2231 3.3725 19.5516 25.4934 32.0936 15.0872 27.3789 8.3807
temp: 298.150 k
press: 1.00000 atm
elementType: 8 8 8 7 7 6 6 6 6 6 6 6 6 1 1 1 1 1 1 1 1 1 1 1 1 1 1
symmnumber: 1
zpe: 583022.7 jmol-1
zpe.correction: 0.222062 hartree
zpe.thermalcorrener: 0.235868 hartree
zpe.thermalcorrenthalpy: 0.236812 hartree
zpe.thermalcorrgfe: 0.180929 hartree
zpe.sumelectzpe: -647.413280 hartree
zpe.sumelectthermal: -647.399474 hartree
zpe.sumelectthermalent: -647.398530 hartree
zpe.sumelectthermalfe: -647.454413 hartree
dipole: 1.8228 3.2004 1.2300
dipole: 3.8830
quadrupole: -67.3556 -72.8649 -84.5385
quadrupole: -1.1952 -5.6947 -2.0625
quadrupole: 7.5641 2.0547 -9.6188 -1.1952 -5.6947 -2.0625
hfenergy: -647.6353415 hartree
pointgroup: C01 [X(C8H14N2O3)]
dipole: 0.7557187 -1.2382083 -0.4791863 debye
polarizability: 121.9506865|-0.9317426|105.2201163|3.5719258|4.3417582|90.9908742 unknown
InChI: InChI=1S/C8H14N2O3/c1-5(9)7(11)10-4-2-3-6(10)8(12)13/h5-6,12H,2-4,9H2,1H3
charge 0 multiplicity 1
27 atoms
O  -1.137715 1.392014 0.931832
O  2.653805 1.892632 0.207285
O  1.386848 1.022089 -1.536742
N  -0.0548 -0.572156 0.378922
N  -3.581808 0.136655 0.896701
C  1.252789 0.009186 0.738148
C  2.188853 -1.232619 0.800418
C  1.580838 -2.187498 -0.258853
C  0.053511 -1.97213 -0.114979
C  -1.194186 0.195999 0.493321
C  1.719262 1.003622 -0.333668
C  -2.529274 -0.417214 0.030679
C  -2.714772 -0.093266 -1.487286
H  1.192871 0.553963 1.693851
H  2.123187 -1.67541 1.810384
H  3.242372 -0.97496 0.605812
H  1.907402 -1.889906 -1.270594
H  1.866626 -3.240004 -0.097368
H  -0.472532 -2.097767 -1.076742
H  -0.387104 -2.674919 0.619414
H  -2.495408 -1.517426 0.153211
H  -2.710511 1.001069 -1.636023
H  -1.9140 -0.527425 -2.115473
H  -3.683335 -0.494915 -1.838914
H  -3.360681 1.094741 1.195284
H  -4.530069 0.031264 0.526047
H  2.954629 2.527581 -0.497868
