program: Gaussian 09
title: 000083465
version: EM64L-G09RevD.01
frameworkgroup: C1[X(C9H7N3O4)]
method: RPBEPBE
basis: SDD
operation: Freq
keyword: #pfreq=noraman
keyword: PBEPBE/SDD
title: #p freq=noraman PBEPBE/SDD
converged: YES YES NO NO
title: Mulliken charges:
elementType: O O O O N N N C C C C C C C C C H H H H H H H
charge: -0.366438 -0.433463 -0.206623 -0.213285 -0.183993 0.019024 -0.134048 0.354892 0.198516 -0.543584 0.126036 -0.339836 0.435307 -0.404015 -0.278685 -0.212197 0.311783 0.286534 0.289472 0.276069 0.268481 0.376272 0.373782
chargesum: 0.00000
title: Mulliken charges with hydrogens summed into heavy atoms:
elementType: O O O O N N N C C C C C C C C C
charge: 0.009834 -0.059681 -0.206623 -0.213285 -0.183993 0.019024 -0.134048 0.354892 0.198516 -0.231801 0.126036 -0.053302 0.435307 -0.114544 -0.002616 0.056284
polarizability: 2.67697080e+02 -2.02914493e+01 1.69529137e+02 -1.18140083e+00 1.65174944e+00 5.34457310e+01
1716.lowfreq: -4.7271 -3.2545 0.0004 0.0006 0.0008 5.3027 54.1303 69.2639 85.7178
frequency: 54.1300 69.2633 85.7175 121.5034 138.8094 191.5324 208.4304 225.8055 281.8685 294.6978 303.8747 327.5919 389.1449 392.4838 444.0272 461.3547 481.9665 494.3178 511.0410 544.9212 580.4353 638.8593 645.2125 697.4395 700.1580 741.3212 743.8783 760.2983 788.3447 864.5407 879.7979 892.2008 916.9070 934.3661 1000.2173 1000.3028 1052.8098 1091.8918 1128.2549 1138.2029 1187.2220 1206.7050 1237.0788 1257.8630 1328.0148 1332.0118 1358.8419 1369.1473 1391.1470 1402.5336 1443.2701 1477.3806 1528.3676 1570.6998 1606.3393 1631.2385 3170.3912 3192.1573 3192.9115 3198.6803 3218.4955 3441.3214 3577.2819
redmass: 12.1194 8.1558 5.0061 5.0042 8.8971 9.5861 7.1697 5.4144 8.4869 3.5418 7.1489 1.3359 9.4152 2.4487 1.3679 6.0831 3.5775 9.0007 6.5172 5.8155 5.7201 3.8336 6.8363 6.3145 6.5442 5.5681 3.7296 5.3871 1.7423 1.4726 6.2079 10.2234 1.4730 1.2591 2.8700 1.5449 4.2203 2.0387 2.0293 1.3709 1.8671 5.9709 1.5600 1.3563 2.4450 1.2696 3.0691 7.7096 2.1445 8.0208 6.3779 3.4345 5.6737 8.4653 7.1195 7.6408 1.0897 1.0893 1.0959 1.0919 1.0976 1.0687 1.0675
irintensity: 0.5260 0.6260 1.0663 2.6444 1.8154 2.1512 1.2278 2.8583 12.3491 29.3595 4.7094 97.2599 19.9792 60.6123 79.6195 3.3765 3.0557 4.1445 1.1740 2.5222 6.8977 0.9039 4.0788 20.0505 15.3307 22.4284 13.8828 5.1048 57.5714 21.8026 28.9815 256.1158 47.2711 1.0480 26.4119 5.8209 13.9748 25.7918 1.6861 14.1862 39.1715 605.4274 10.2592 33.1646 35.2776 63.8095 56.1002 112.1595 57.3041 38.5480 66.6558 21.9802 77.1412 18.0760 4.1417 66.1076 0.9479 1.7868 0.9323 9.6831 1.3298 18.4640 125.0579
temp: 298.150 k
press: 1.00000 atm
elementType: 8 8 8 8 7 7 7 6 6 6 6 6 6 6 6 6 1 1 1 1 1 1 1
symmnumber: 1
zpe: 409942.4 jmol-1
zpe.correction: 0.156139 hartree
zpe.thermalcorrener: 0.169689 hartree
zpe.thermalcorrenthalpy: 0.170633 hartree
zpe.thermalcorrgfe: 0.115738 hartree
zpe.sumelectzpe: -810.986903 hartree
zpe.sumelectthermal: -810.973353 hartree
zpe.sumelectthermalent: -810.972408 hartree
zpe.sumelectthermalfe: -811.027303 hartree
dipole: 5.0501 1.9179 1.5523
dipole: 5.6207
quadrupole: -109.9472 -76.5417 -92.2689
quadrupole: -2.3647 -0.7460 6.0404
quadrupole: -17.0279 16.3776 0.6504 -2.3647 -0.7460 6.0404
hfenergy: -811.1430414 hartree
pointgroup: C01 [X(C9H7N3O4)]
dipole: 2.0092553 -0.6779583 -0.6271234 debye
dipolederiv: -0.3476193 0.0263695 0.0296788 0.1181937 -0.5184557 -0.0496988 0.0390314 0.0416666 0.0853347 -1.8145841 -0.7551443 -0.0162407 0.0172099 0.0113905 -0.0011826 -0.0366295 -0.0190135 -0.3808508 -0.9869916 0.1808373 0.0145034 0.4992174 -0.5839069 -0.0168506 0.0248808 -0.0127117 -0.2278798 -0.8240231 -0.1900595 0.0023891 -0.505544 -0.7180955 -0.0084673 -0.0091918 -0.0147668 -0.233123 -0.738076 0.0461044 -0.0434679 0.4779889 -0.0392009 -0.0125032 -0.0663113 -0.2341517 -0.1684878 2.3671011 0.0812896 -0.0245255 0.1348439 1.0768182 0.0265635 -0.033843 0.0265107 0.1809099 1.2041652 0.6424053 0.0207056 0.1277468 -0.5012212 -0.0108287 0.0453083 0.0146837 -0.2145501 -0.0130905 -0.6140991 -0.0301442 -0.874733 0.3757853 0.0539256 -0.017225 0.0989061 0.0906099 0.5488771 -0.099636 -0.0063821 0.2929416 -0.0029154 -0.0039994 0.007835 0.0035236 0.0219784 0.1973671 0.3228833 0.0115387 -0.2275829 -0.1653986 -0.0122612 -0.0110728 -0.0406885 -0.1572813 -0.3160708 -0.0671492 -0.0090199 -0.4542358 0.4072283 -0.0007391 -0.0129683 -0.0111937 0.0726109 -0.2764635 0.1712136 0.0065797 0.1786448 0.0231776 0.0030397 0.0000291 -0.0002543 -0.109073 -1.0463425 -0.1269983 0.0062508 0.0460626 0.2386508 0.0055199 0.0145428 0.0073228 0.0619777 0.1302677 -0.1586924 -0.0075425 0.1429751 -0.1117734 -0.004889 0.0038173 0.0010586 -0.1249904 -0.10197 0.0101318 0.0051077 -0.3697751 -0.4876298 -0.0219545 0.0013353 0.0211471 -0.1835999 0.9426814 0.4717766 0.0932834 0.2296485 0.1797724 0.0265152 0.1023052 0.1046701 -0.0378662 0.14061 -0.0227238 0.0001775 0.0071466 0.0849821 -0.0059425 0.0090462 -0.0031625 0.1879665 0.073481 -0.0675381 -0.0025072 -0.0173873 0.0375153 -0.0024469 -0.001233 0.0011412 0.1490158 0.0812011 0.056415 0.0013693 0.0162855 0.0701069 -0.0017553 0.0000267 -0.0027816 0.1745599 0.0144308 0.0440718 -0.0072815 -0.0301372 0.086678 -0.0013952 0.0001025 -0.01182 0.1851598 0.0914133 0.024759 -0.0043893 0.0592017 0.0176371 -0.0014545 -0.0113975 -0.0086665 0.1709756 0.2738127 -0.0603589 -0.0393888 -0.0309142 0.3461673 0.0355643 -0.0441279 0.0346051 0.0672678 0.3998229 0.0841424 -0.0006944 0.1622019 0.1726876 0.0052406 -0.0042604 0.0039751 0.3893356 unknown
polarizability: 266.2716705|23.438159|170.8591911|1.1372578|3.7841718|53.5410864 unknown
InChI: InChI=1S/C9H7N3O4/c13-10-8-3-4-11(14)9-5-6(12(15)16)1-2-7(8)9/h1-5,13-14H
charge 0 multiplicity 1
23 atoms
O  0.309211 -3.168281 0.040254
O  4.257546 1.731645 0.018476
O  -4.201161 1.338477 0.050688
O  -4.039518 -0.938037 -0.019981
N  0.934472 -1.880848 -0.143794
N  -3.51487 0.24416 0.009454
N  2.795959 1.846872 -0.016861
C  0.124618 -0.730846 -0.066551
C  0.775718 0.55004 -0.032682
C  -1.283667 -0.835149 -0.041494
C  2.252305 0.6221 -0.015053
C  -0.038305 1.714438 -0.001512
C  -2.038224 0.351067 -0.010655
C  -1.437914 1.63284 0.004753
C  2.98728 -0.637082 0.024607
C  2.319346 -1.83736 -0.020582
H  -1.788578 -1.802297 -0.020781
H  0.464715 2.684791 0.02234
H  -2.07026 2.523251 0.028143
H  4.07541 -0.617196 0.083798
H  2.811396 -2.811099 0.016961
H  0.048891 -3.470666 -0.876228
H  4.541632 2.680881 0.013201
