program: Gaussian 09
title: 000083445
version: EM64L-G09RevD.01
frameworkgroup: C1[X(C9H8N2O4)]
method: RPBEPBE
basis: SDD
operation: Freq
keyword: #pfreq=noraman
keyword: PBEPBE/SDD
title: #p freq=noraman PBEPBE/SDD
converged: YES YES NO NO
title: Mulliken charges:
elementType: O O O O N N C C C C C C C C C H H H H H H H H
charge: -0.212178 -0.419538 -0.317855 -0.221626 -0.454141 -0.650728 0.107723 0.150198 -0.319158 -0.302730 0.179014 -0.220586 -0.223796 0.154644 0.263093 0.291781 0.278561 0.244576 0.243696 0.365553 0.394602 0.325666 0.343229
chargesum: 0.00000
title: Mulliken charges with hydrogens summed into heavy atoms:
elementType: O O O O N N C C C C C C C C C
charge: -0.212178 -0.024935 -0.317855 -0.221626 -0.088588 0.018167 0.107723 0.150198 -0.027378 -0.024169 0.179014 0.023990 0.019900 0.154644 0.263093
polarizability: 1.77101059e+02 -1.11160733e+01 1.51595364e+02 -1.62427123e+00 -9.29901333e-01 5.39695761e+01
1716.lowfreq: -6.5904 -0.0009 -0.0006 0.0004 3.4585 6.5900 31.5871 36.5745 64.4740
frequency: 31.5688 36.5575 64.4726 89.9720 113.0333 136.2974 208.2910 231.9149 255.4271 294.4022 380.0533 400.9676 409.9397 438.7987 453.1623 458.9781 534.8887 538.1171 561.7684 603.9147 615.9764 650.6470 673.2712 703.5338 727.5329 767.2556 782.6637 794.7324 854.7236 890.7534 904.1439 915.0666 989.6444 1012.8952 1020.7269 1051.4112 1065.4557 1094.9341 1142.2574 1155.0595 1184.5845 1249.5384 1276.1675 1305.4454 1323.4196 1373.2388 1417.4722 1468.5978 1531.0486 1564.8281 1587.0390 1603.4057 1615.8600 1652.1771 1705.4828 3142.9096 3159.9772 3172.9820 3187.5316 3207.2507 3523.7759 3527.0961 3688.9185
redmass: 9.0804 6.8989 6.2577 4.8182 6.2201 6.5109 5.6014 10.8780 7.4616 5.5498 6.6744 6.7107 4.0974 2.8158 4.5731 1.3936 1.2227 4.3183 4.0544 1.3467 4.1462 5.5481 4.3373 3.4472 5.9431 5.6894 4.4822 1.5475 3.2042 1.5440 3.1485 1.5295 1.3893 1.3763 5.5960 3.0733 2.0078 2.8149 1.9391 1.9143 1.0729 3.6415 1.5298 3.5303 2.7705 10.8979 1.9769 2.4165 2.6780 6.1391 5.8562 5.8076 1.5287 2.1918 3.5813 1.0870 1.0917 1.0959 1.0968 1.0851 1.0642 1.0460 1.1041
irintensity: 1.6509 7.7541 3.9368 5.9469 3.1909 0.8881 0.6004 0.4871 1.0023 2.6175 2.2233 10.3818 9.7310 4.5770 3.7313 103.7986 187.5570 13.4883 23.4784 105.4021 55.6757 5.9426 3.2317 79.3232 43.0501 5.4511 3.0099 51.7353 59.6713 141.9364 25.3313 3.7015 7.4694 2.0591 187.2521 5.5186 11.9044 85.1939 23.2641 94.7230 5.9957 217.4962 40.4355 265.7542 91.5158 24.2640 1.2602 48.9443 726.7097 20.1049 289.8774 70.0932 16.2801 161.5897 222.5817 4.8646 6.8740 9.6376 9.0350 472.5368 66.4115 39.7286 47.1792
temp: 298.150 k
press: 1.00000 atm
elementType: 8 8 8 8 7 7 6 6 6 6 6 6 6 6 6 1 1 1 1 1 1 1 1
symmnumber: 1
zpe: 433789.6 jmol-1
zpe.correction: 0.165222 hartree
zpe.thermalcorrener: 0.178599 hartree
zpe.thermalcorrenthalpy: 0.179544 hartree
zpe.thermalcorrgfe: 0.123637 hartree
zpe.sumelectzpe: -757.120292 hartree
zpe.sumelectthermal: -757.106914 hartree
zpe.sumelectthermalent: -757.105970 hartree
zpe.sumelectthermalfe: -757.161877 hartree
dipole: 5.2203 6.1219 -1.2355
dipole: 8.1398
quadrupole: -80.2561 -77.5356 -89.6893
quadrupole: -19.2448 0.5126 4.0642
quadrupole: 2.2376 4.9581 -7.1957 -19.2448 0.5126 4.0642
hfenergy: -757.2855137 hartree
pointgroup: C01 [X(C9H8N2O4)]
dipole: -2.0634152 -2.106703 -1.2488774 debye
dipolederiv: -0.6503357 -0.1094133 -0.1141346 0.1164388 -0.582502 -0.3048802 0.1096372 -0.2573719 -0.6050836 -0.5869591 -0.5380296 -0.0777014 -0.4577363 -1.1685927 -0.0135269 -0.0347846 0.0544624 -0.3681937 -1.1914822 0.0108949 0.2121813 0.0173843 -0.7943008 -0.1763182 0.2707562 -0.0933828 -0.4414131 -0.9417056 -0.2201909 -0.0592449 -0.2464866 -0.734944 -0.1527631 -0.1110665 -0.1413693 -0.3943991 -2.0488996 0.2493924 0.3795334 0.0638564 -0.631172 -0.1957092 0.2715722 -0.246361 -0.529843 -0.6846385 0.3707912 0.1666364 0.4672125 -0.8716918 -0.135545 0.2180294 -0.1407901 -0.8649097 -0.2427023 0.078243 0.0219727 -0.2325214 0.1840661 0.0316663 -0.1412407 -0.0236013 -0.0345142 -0.1092801 0.2491108 0.0967509 0.3055745 -0.5718424 -0.1653595 0.1620442 -0.154522 -0.0639983 -0.3106727 0.2054089 0.062318 0.1399466 -0.054172 0.015331 0.007441 0.0594517 -0.0856495 -0.1506822 -0.2032907 -0.0637665 0.1330065 0.060743 0.0532443 0.0318859 0.0895872 -0.068291 1.6121011 -0.071318 -0.0765403 -0.5054546 0.6885407 0.571611 -0.4138773 0.4517793 0.7739205 0.1688023 -0.1288177 -0.0354763 -0.0318449 0.1437541 0.0808152 0.0196053 0.0811292 -0.0864397 0.1574057 0.0064501 0.0174287 -0.1586468 -0.2190972 -0.0293776 -0.0361734 -0.0283336 -0.1534628 1.404179 0.1335759 -0.3370822 0.007628 1.8597778 0.315631 -0.4184985 0.2393476 0.4240222 2.3666662 -0.219093 -0.3276416 -0.0040114 1.3024689 0.4570795 -0.1091613 0.4715578 0.5625887 0.147746 -0.0649787 -0.0191876 -0.0313597 0.0624536 -0.0249962 0.0040806 -0.0456261 0.1420796 0.0635483 -0.0487121 -0.0239471 -0.0646973 0.0525922 -0.0421635 -0.007707 -0.0461111 0.1400591 0.0379709 0.0744603 0.0170385 0.093268 -0.0270762 -0.0552802 0.0154906 -0.0572517 0.1344876 -0.1037379 0.0161503 -0.0068219 -0.0030557 0.0989194 -0.0195321 -0.0152594 -0.0249293 0.1514065 0.4065253 0.1723012 0.0728918 0.4011639 0.4311318 -0.0181669 0.096724 0.0508448 0.2926804 0.2333792 0.1266777 0.0913262 0.0859882 0.3692685 -0.0307898 0.0814056 -0.0898542 0.349173 0.2174115 -0.0509078 0.0020069 -0.0717161 0.181981 -0.0831299 -0.0174671 -0.0678815 0.3681331 0.2053604 -0.0387051 0.0014594 -0.0239368 0.2196939 -0.0778399 0.0165635 -0.0807743 0.3576469 unknown
polarizability: 177.0733169|-8.5577032|137.3002185|-8.0907942|34.3891995|68.2924636 unknown
InChI: InChI=1S/C9H8N2O4/c10-9(15)11-7(12)5-3-1-2-4-6(5)8(13)14/h1-4,11,13H,10H2
charge 0 multiplicity 1
23 atoms
O  1.269583 1.951317 1.147675
O  -1.653311 -2.645704 -0.757679
O  0.407803 -1.800897 -1.282541
O  3.889071 1.384292 -0.031862
N  1.788333 0.310076 -0.445073
N  3.786027 -0.692775 -1.087177
C  -0.600767 0.866237 0.066368
C  -1.342019 -0.292266 -0.371372
C  -1.347132 2.019535 0.430396
C  -2.769109 -0.236918 -0.401421
C  0.911172 1.076844 0.311992
C  -2.751814 2.06999 0.357874
C  -3.472572 0.928729 -0.056941
C  -0.754899 -1.58471 -0.826551
C  3.216222 0.420378 -0.468415
H  -0.776965 2.875966 0.802051
H  -3.314178 -1.132136 -0.709264
H  -3.27746 2.989837 0.634739
H  -4.565978 0.942838 -0.106075
H  1.366713 -0.463561 -0.994862
H  -1.21342 -3.464092 -1.114303
H  3.249568 -1.514557 -1.362414
H  4.797335 -0.693826 -1.196046
